{"text_format":"3","workbook":"xlsx","n_sheets":4,"sheets":["requisition form","back up docs","projects","Lookups"],"not_rendered":{"defined_names":17},"read":"whole","date_system":"1900"}

{"sheet":"requisition form","index":0,"n_rows":45,"n_cols":14,"rows_kept":45,"merged":[[1,0,1,4],[1,5,1,9],[2,12,2,13],[3,2,3,3],[3,4,3,5],[3,7,3,9],[4,0,5,0],[4,1,5,5],[4,7,4,9],[4,12,4,14],[5,7,5,9],[6,0,9,0],[6,1,6,5],[6,7,6,9],[7,1,7,5],[7,7,7,9],[8,1,8,5],[8,7,8,9],[9,1,9,5],[9,7,9,9],[11,1,11,9],[14,0,14,2],[15,0,15,2],[16,0,16,2],[17,0,17,2],[18,0,18,2],[19,0,19,2],[20,0,20,2],[21,0,21,2],[22,0,22,2],[23,0,23,2],[24,0,24,2],[25,0,25,2],[26,0,26,2],[27,0,27,2],[28,0,28,2],[29,0,29,2],[30,0,30,2],[31,0,31,2],[32,0,32,2],[33,0,33,2],[34,0,34,2],[35,0,35,2],[37,0,37,3],[38,0,38,3],[39,0,39,3],[40,0,40,3],[41,0,41,3],[42,0,42,3],[43,0,43,3]]}
["ISI Requisition Form"]
[{"$f":"Lookups!H16","v":"The deadline for A/P vendor payments is Wednesday Aug 21 at noon."},{"$nulls":4},"Paste backup documentation on backup up docs tab. Email/scan to requisitions@isionline.org",{"$nulls":5},"date filled out",{"$f":"datefilledout","v":"2019-08-15"},{"$f":"TEXT(datefilledout,\"DDDD\")","v":"Thursday"}]
["Yellow spaces must be filled in to be accepted, Green spaces are for Finance use only.",{"$nulls":10},"current time",{"$f":"currenttime","v":43692.46481967592}]
["Date (mm/dd/yy)",null,"Charge To",null,{"$f":"VLOOKUP(F15,Fund_codes,2,)","v":" "},null,"Batch #:",{"$nulls":4},"deadline time",{"$f":"deadlinetime","v":"12:00:00"}]
["Special Instructions (i.e. \"Return Check to Requestor\")",{"$nulls":5},"Date Pd:",{"$nulls":4},"due date",{"$f":"duedate","v":{"$error":"#NAME?"}}]
[{"$nulls":6},"Optional Invoice #",{"$nulls":5},{"$f":"VLOOKUP(duedate,Deadlines,3,TRUE)","v":{"$error":"#NAME?"}}]
["PAY     TO",{"$nulls":5},"Requisition #",{"$f":"UPPER(LEFT(B7,3)&RIGHT(B7,2)&IF(Due_Date>0,Due_Date,IF(OR(Date_Filed<>\"\",Date_Filed>0),Date_Filed,TODAY())))","v":"43692"}]
[{"$nulls":6},"Requested By:"]
[{"$nulls":6},"Date Needed"]
[{"$nulls":6},"Payment Type","(Please choose one)"]
[{"$nulls":11},{"$f":"_xlfn.IFNA(IF(D15=300,\"Tovar\",IF(D15=500,\"\",VLOOKUP(F15,projects!I6:J34,2,))),\"\")","v":""}]
["Additional Comments"]
[]
["Description Written on Check Stub",null,null,"Fund","Expense Code","Project/Dept","Qty","Unit Price",null,"Subtotal"]
[" ",null,null,{"$f":"_xlfn.IFNA(VLOOKUP(F15,Fund_codes,4,),\"\")","v":0},{"$f":"VLOOKUP(E16,GLcodes,2,)","v":" "}," ",{"$nulls":3},{"$f":"IF($H$9=\"\",\"Enter Date Needed\",H15*G15)","v":"Enter Date Needed"}]
[{"$f":"IF(AND(E15<30000,$E$4>0),\"Please talk with Finance\",\"\")","v":""},{"$nulls":3},"If code unknown, lookup here.","If Dept unknown, lookup here"]
[{"$nulls":3},{"$f":"_xlfn.IFNA(VLOOKUP(F17,Fund_codes,4,),\"\")","v":0},{"$f":"VLOOKUP(E18,GLcodes,2,)","v":" "}," ",{"$nulls":3},{"$f":"IF($H$9=\"\",\"Enter Date Needed\",H17*G17)","v":"Enter Date Needed"}]
[{"$f":"IF(AND(E17<30000,$E$4>0),\"Please talk with Finance\",\"\")","v":""},{"$nulls":3},"If code unknown, lookup here.","If Dept unknown, lookup here"]
[{"$nulls":3},{"$f":"_xlfn.IFNA(VLOOKUP(F19,Fund_codes,4,),\"\")","v":0},{"$f":"VLOOKUP(E20,GLcodes,2,)","v":" "}," ",{"$nulls":3},{"$f":"IF($H$9=\"\",\"Enter Date Needed\",H19*G19)","v":"Enter Date Needed"}]
[{"$f":"IF(AND(E19<30000,$E$4>0),\"Please talk with Finance\",\"\")","v":""},{"$nulls":3},"If code unknown, lookup here.","If Dept unknown, lookup here"]
[{"$nulls":3},{"$f":"_xlfn.IFNA(VLOOKUP(F21,Fund_codes,4,),\"\")","v":0},{"$f":"VLOOKUP(E22,GLcodes,2,)","v":" "}," ",{"$nulls":3},{"$f":"IF($H$9=\"\",\"Enter Date Needed\",H21*G21)","v":"Enter Date Needed"}]
[{"$f":"IF(AND(E21<30000,$E$4>0),\"Please talk with Finance\",\"\")","v":""},{"$nulls":3},"If code unknown, lookup here.","If Dept unknown, lookup here"]
[{"$nulls":3},{"$f":"_xlfn.IFNA(VLOOKUP(F23,Fund_codes,4,),\"\")","v":0},{"$f":"VLOOKUP(E24,GLcodes,2,)","v":" "}," ",{"$nulls":3},{"$f":"IF($H$9=\"\",\"Enter Date Needed\",H23*G23)","v":"Enter Date Needed"}]
[{"$f":"IF(AND(E23<30000,$E$4>0),\"Please talk with Finance\",\"\")","v":""},{"$nulls":3},"If code unknown, lookup here.","If Dept unknown, lookup here"]
[{"$nulls":3},{"$f":"_xlfn.IFNA(VLOOKUP(F25,Fund_codes,4,),\"\")","v":0},{"$f":"VLOOKUP(E26,GLcodes,2,)","v":" "}," ",{"$nulls":3},{"$f":"IF($H$9=\"\",\"Enter Date Needed\",H25*G25)","v":"Enter Date Needed"}]
[{"$f":"IF(AND(E25<30000,$E$4>0),\"Please talk with Finance\",\"\")","v":""},{"$nulls":3},"If code unknown, lookup here.","If Dept unknown, lookup here"]
[{"$nulls":3},{"$f":"_xlfn.IFNA(VLOOKUP(F27,Fund_codes,4,),\"\")","v":0},{"$f":"VLOOKUP(E28,GLcodes,2,)","v":" "}," ",{"$nulls":3},{"$f":"IF($H$9=\"\",\"Enter Date Needed\",H27*G27)","v":"Enter Date Needed"}]
[{"$f":"IF(AND(E27<30000,$E$4>0),\"Please talk with Finance\",\"\")","v":""},{"$nulls":3},"If code unknown, lookup here.","If Dept unknown, lookup here"]
[{"$nulls":3},{"$f":"_xlfn.IFNA(VLOOKUP(F29,Fund_codes,4,),\"\")","v":0},{"$f":"VLOOKUP(E30,GLcodes,2,)","v":" "}," ",{"$nulls":3},{"$f":"IF($H$9=\"\",\"Enter Date Needed\",H29*G29)","v":"Enter Date Needed"}]
[{"$f":"IF(AND(E29<30000,$E$4>0),\"Please talk with Finance\",\"\")","v":""},{"$nulls":3},"If code unknown, lookup here.","If Dept unknown, lookup here"]
[{"$nulls":3},{"$f":"_xlfn.IFNA(VLOOKUP(F31,Fund_codes,4,),\"\")","v":0},{"$f":"VLOOKUP(E32,GLcodes,2,)","v":" "}," ",{"$nulls":3},{"$f":"IF($H$9=\"\",\"Enter Date Needed\",H31*G31)","v":"Enter Date Needed"}]
[{"$f":"IF(AND(E31<30000,$E$4>0),\"Please talk with Finance\",\"\")","v":""},{"$nulls":3},"If code unknown, lookup here.","If Dept unknown, lookup here"]
[{"$nulls":3},{"$f":"_xlfn.IFNA(VLOOKUP(F33,Fund_codes,4,),\"\")","v":0},{"$f":"VLOOKUP(E34,GLcodes,2,)","v":" "}," ",{"$nulls":3},{"$f":"IF($H$9=\"\",\"Enter Date Needed\",H33*G33)","v":"Enter Date Needed"}]
[{"$f":"IF(AND(E33<30000,$E$4>0),\"Please talk with Finance\",\"\")","v":""},{"$nulls":3},"If code unknown, lookup here.","If Dept unknown, lookup here"]
[{"$nulls":3},{"$f":"_xlfn.IFNA(VLOOKUP(F35,Fund_codes,4,),\"\")","v":0},{"$f":"VLOOKUP(E36,GLcodes,2,)","v":" "}," ",{"$nulls":3},{"$f":"IF($H$9=\"\",\"Enter Date Needed\",H35*G35)","v":"Enter Date Needed"}]
[{"$f":"IF(AND(E35<30000,$E$4>0),\"Please talk with Finance\",\"\")","v":""},{"$nulls":3},"If code unknown, lookup here.","If Dept unknown, lookup here"]
[{"$nulls":5},"Total",{"$nulls":3},{"$f":"SUM(J15:J36)","v":0}]
["Approval Signatures -- Per Signature Authorization List"]
[{"$f":"\"Department Supervisor - \"&L11","v":"Department Supervisor - "},{"$nulls":3},"Once filled out this should be emailed to supervisor"]
[{"$nulls":4},"who approves it and then emails it to Finance Dept"]
["Finance Dept Approval"]
[{"$nulls":4},"Any supporting documents should be scanned and"]
["Executive Office",{"$nulls":3},"attached (or pasted) with this document to all parties"]
[]
["Updated 08/15/2019"]

{"sheet":"back up docs","index":1,"n_rows":164,"n_cols":20,"rows_kept":164}
{"$rows_empty":163}
[{"$nulls":19},"."]

{"sheet":"projects","index":2,"n_rows":678,"n_cols":10,"rows_kept":678}
["Account Code","Account Title","dept","fund",null,"If code unknown, lookup here."," "]
[null,"If Dept unknown, lookup here"]
[" "," "]
[1100,"Executive Office (1100) 0%",{"$f":"A4","v":1100},100]
[1101,"President's Contingency (1101) 0%",1101,100,null,"A/P to Ltd",24131]
[1503,"Lahart Trust (1503) 0%",1503,500,null,"Account Receivable - pledged donations",14150,null,1100,"Shaw"]
[1600,"Land Acquisition (1600) 0%",1600,300,null,"Accounts Receivable",14130,null,1101,"Shaw"]
[2101,"Ministry Department (2101) 0% {Tovar}",2101,100,null,"Accounts Receivable - ISILtd",14131,null,1503,"Tovar"]
[2102,"National Training Department (2102) 0% {Decker}",2102,100,null,"Accounts Receivable - ISIntl",14132,null,1600,"Tovar"]
[2104,"People Services (2104) 0% {Bolton}",2104,100,null,"Accounts Receivable-NSF Checks",14145,null,2101,"Decker"]
[2301,"Western Region  (2301) 0% {Zeigler}",2301,100,null,"Accumulated Depreciation",16900,null,2102,"Decker"]
[2302,"SE / Great Lakes Region (2302) 0% {Germann}",2302,100,null,"Advertising",55100,null,2104,"Bolton"]
[2303,"RM & Plains Region (2303) 0% {Yabuki}",2303,100,null,"Annual Audit - Capin Crouse",55233,null,2301,"Zeigler"]
[2304,"Director of Field Development (2304) 0% {Townsend}",2304,100,null,"Bank Charges",56150,null,2302,"Germann"]
[2306,"Northeastern Region (2306) 10% {Larson}",2306,100,null,"Bankers Life & Casualty (220047932",11208,null,2303,"Yabuki"]
[2307,"Research and Innovation (2307) {jackson}",2307,100,null,"Benevolence",55145,null,2304,"Townsend"]
[2500,"Global Ministries (2500) {crowell, g}",2500,100,null,"Board Meeting Expense",53515,null,2306,"Larson"]
[2510,"ISnt'l Singapore (2510) 0%",2510,100,null,"Board of Trustees Expense",55120,null,2307,"jackson"]
[2530,"IS International Misc Countries (2530) 0%",2530,500,null,"Building Improvements",16250,null,2500,"prensner"]
[2600,"Web site/Publications (2600) 0% {MillerR}",2600,100,null,"Building Improvements",16251,null,2510,"Tovar"]
[3000,"Building (3000) 0%",3000,100,null,"Business Meetings",53200,null,2520,"Tovar"]
[3100,"Operations (3100) 0%",3100,100,null,"Cash Advance - Field Staff Projects",53105,null,2530,"Tovar"]
[3111,"Western Region (3111) 10% {zeigler}",3111,500,null,"Cash Advance - Home Office",14120,null,2600,"MillerR"]
[3112,"Rocky Mtn Region (3112) 10% {Yabuki}",3112,500,null,"Cellular Phone Charges",55311,null,3000,"Tovar"]
[3115,"Northeastern Reg (3115) 10% {Larson}",3115,500,null,"Cobra Liability Payments (Med/Dent)",21150,null,3100,"Tovar"]
[3116,"Northwestern Reg (3116) 10% {Germann}",3116,500,null,"Coffee Supplies",55224,null,3111,"zeigler"]
[3117,"SE & Great Lakes Region (3117) 10% {Germann}",3117,500,null,"Computer Equipment",16400,null,3112,"Yabuki"]
[3150,"Expansion & Recruitment (3150) 0%",3150,100,null,"Computer On-Line Service",55130,null,3115,"Larson"]
[3200,"Finance (3200) 0% {Spengler}",3200,100,null,"Computer Purchase",55175,null,3116,"Germann"]
[3290,"Interest/Div Income (3290) 0%",3290,100,null,"Computer Software",16450,null,3117,"Germann"]
[3300,"Ministry Advancement  (3300) 0% {Holland}",3300,100,null,"Computer Support",55135,null,3150,"Decker"]
[3301,"San Diego Launch Initiatives (3301) 0%",3301,100,null,"Constructioin in Progress",16240,null,3200,"Spengler"]
[3302,"Houston Launch Initiatives (3302) 0%",3302,100,null,"Contingency",56460,null,3290,"Spengler"]
[3303,"NMF Major Donor Days (3303) 0%",3303,100,null,"Contract - Annual Equip Maint",55201,null,3300,"Holland"]
[5001,"Ithica NY (5001) 15% {larson}",5001,500,null,"Contracts-Maintenance",55200]
[5002,"Western NY & PA Event (5002) 10% {larson}",5002,500,null,"CPA/Prof Financial Assistance",55232]
[5003,"Monmouth OR City (5003) 15% {Zeigler}",5003,500,null,"Deposits on Contracts",53505]
[5004,"NE Regional Mobilization  (5004) 15% {Cossette}",5004,500,null,"Disaster Recovery Cost",56465]
[5005,"Evangeline Tharp Mem. Fnd (5005) 10% {Depalatis}",5005,500,null,"Displays",54120]
[5006,"Auraria Ministry (5006) 15% {Mills}",5006,500,null,"Donations",55140]
[5007,"Lincoln NE City (5007) 15% {Spaulding}",5007,500,null,"Donor Appreciation Gifts",55300]
[5008,"Bloomington/Normal, Illinois (5008) 15% {berger}",5008,500,null,"Dues & Subscriptions",55150]
[5009,"KC Fund Raise Event (5009) 10% {douglass}",5009,500,null,"ECCU Savings Account",11209]
[5010,"Colorado Springs Retreat  (5010) 15% {halverson}",5010,500,null,"ECCU-Canadian Donations to ISI",11210]
[5011,"San Francisco City (5011) 15% {Thomas C}",5011,500,null,"ECCU-General Fund",11204]
[5012,"Northridge Area, CA (5012) 15% {Downs}",5012,500,null,"Facility Rental",52310]
[5013,"West/Cent NY & West PA (5013) 15% {larson}",5013,500,null,"Field Conferences/Banquets",54130]
[5014,"Western Massachusetts Area (5014) 15% {S. Hope}",5014,500,null,"Field Staff Materials",50141]
[5015,"Bloomington, IN Special (5015) 10% {hawes}",5015,500,null,"Field Staff Postage",50140]
[5016,"Santz Cruz Events (5016) 5%5% {pollard}",5016,500,null,"Field Staff Stationery",50142]
[5017,"Iowa City (5017) 15% {younkin}",5017,500,null,"Furniture & Equipment",16300]
[5018,"Northern Cal Student Activity (5018) 15% {Pollard}",5018,500,null,"Graphics",55262]
[5019,"Northridge, CA Events (5019) 10% {downs}",5019,500,null,"Graphics-Appeal Letter",55261]
[5020,"Purdue University IN (5020) 15% {zull}",5020,500,null,"Graphics-Passport",55260]
[5021,"Fayetteville City (5021) 15% {yabuki}",5021,500,null,"HO Office Lease CAM Charges",52305]
[5022,"Tyler Tx (5022) 15% {Lindvall}",5022,500,null,"Home Office Fixed Assets",50114]
[5023,"Sout Bay Pennisula CA  (5023) 15% {Zeigler}",5023,500,null,"Honorariums - Nonemployees",51145]
[5024,"Tempe Grad Ministry (5024) 15% {peterson}",5024,500,null,"Honorariums - Employees",17130]
[5025,"Eugene Events (5025) 5%-5% {Smucker}",5025,500,null,"Insurance - Cyber/Web Liability",52140]
[5026,"Durham City Student Activity (5026) 15% {Kronstad}",5026,500,null,"Insurance - International",52130]
[5027,"ID/MT Area Mobilization (5027) 15% {Spady}",5027,500,null,"Insurance - Lawyer-s Prof",52110]
[5028,"Greely CO (5028) 15% {Shelley}",5028,500,null,"Insurance - Officers/Directors",52120]
[5029,"New Brunswick, NJ City (5029) 15% {mannon}",5029,500,null,"Insurance-Liability & Property",52100]
[5030,"NE Region TRUE Retreats (5030) 10% {larson}",5030,500,null,"Intercompany Transfers",60010]
[5031,"Wichita Activity Acct (5031) 15% {allen}",5031,500,null,"Internet Connect Fees",55315]
[5033,"Philadelphia City (5033) 15% {Newbrander}",5033,500,null,"Janitorial",55245]
[5034,"Reno City Account (5034) 15% {Cutler}",5034,500,null,"Lease Equipment-PRINTERS",55161]
[5035,"Hope Special (5035) 10%",{"$f":"A68","v":5035},500,null,"Leased Equipment",55160]
[5036,"Cossette Special (5036) 10%",5036,500,null,"Legal fees - normal issues",55234]
[5037,"Miller RG Special (5037) 10%",5037,500,null,"Literature Production",54140]
[5038,"Stillwater, OK (5038) 15%",5038,500,null,"Literature Purchases",54150]
[5039,"Northern NJ Area (5039) 15% {Innis}",5039,500,null,"Maintenance",52200]
[5040,"Western Region True Retreat (5040) 15%",5040,500,null,"Materials for Ministry",54110]
[5041,"Urbana/Champaign, IL (5041) 15% {Krehbeil}",5041,500,null,"Meetings & Seminars",53500]
[5042,"Boyle C Special (5042) 10%",5042,500,null,"Mileage Expense",55110]
[5043,"Blacksburg VA (5043) 15%",5043,500,null,"Ministry Initiatives",53000]
[5044,"Newark, DE (5044) 15% {Larson}",5044,500,null,"Ministry/Organization Support",55141]
[5045,"Shelley Special (5045) 10%",5045,500,null,"Minor Capital",55170]
[5046,"Cox Special (5046) 10%",5046,500,null,"Miscellanous",55210]
[5047,"Richland College, TX (5047) 15% {christofer}",5047,500,null,"Moving Expenses",55219]
[5048,"Colo Spgs Fund Event (5048) 5%5% {halverson}",5048,500,null,"Nat-l Staff Conference Expense",53201]
[5059,"Undergraduate Ministries AZ",5059,500,null,"NSO Fees",50150]
[5060,"Disaster Relief Fund (5060) 25%",5060,200,null,"New Staff Orientation Fees",55216]
[5061,"Charlottesville, VA (5061) 15%",5061,500,null,"Newsletter/Passport",55293]
[5062,"Ingram Special (5062) 10%",5062,500,null,"NSC Attendance",55215]
[5075,"Top Strategic Initiative (5075) 25%",5075,500,null,"NSC fees",50151]
[5080,"ISI Global Impact Initiatives (5080) 25%",5080,500,null,"Office Rent",52300]
[5097,"Bevan Special (5097) 10%",5097,500,null,"Office Supplies - Copy Paper",55220]
[5098,"Halverson Special (5098) 10%",5098,500,null,"Office Supplies - Package/Ship",55222]
[5101,"India/China Outreach (5101) 25%",5101,300,null,"Office Supplies - Toner Produc",55221]
[5105,"National Staff Conference (5105) 0%",5105,200,null,"Office Supplies-General",55230]
[5111,"Ponten, Mary Jane (5111)8.5%",5111,500,null,"Outreach",55411]
[5127,"Parkins, Daniel (5127) 15%",5127,500,null,"Outside Professional Fees",55290]
[5129,"China Ministries (5129) 25%",5129,300,null,"Outside Storage Rental",52301]
[5130,"Nat Dir Fld Team Min (5130) 15%",5130,500,null,"Payments to Annuitants",56110]
[5132,"Equip Initiatives (5132) 25%",5132,200,null,"Penalties - sales/payroll/tax/etc",56190]
[5134,"Orientation/Training (5134) 0% {Decker}",5134,200,null,"Petty Cash",11100]
[5136,"Pearce, Andy (5136) 15%",5136,500,null,"Photocopying",55250]
[5137,"Pearce Special (5137) 10%",5137,500,null,"Postage",55270]
[5138,"Congdon Special (5138)10%",5138,500,null,"Postage - Appeal",55275]
[5139,"Congdon, Gene & Patti (5139) 15%",5139,500,null,"Postage - Passport",55274]
[5141,"Alumbaugh, Jon & Ruth (5141) min rep 15%",5141,500,null,"Postage-Acquisition",55276]
[5142,"Kaneshiro, Melanie (5142) MR 15%",5142,500,null,"POSTAGE-RECEIPTS",55273]
[5143,"Jackson, Sandra & Bob (5143) 15%",5143,500,null,"Prepaid Dental Insurance",13212]
[5144,"Daniel, Kimberly (5144) 15%",5144,500,null,"Prepaid Disability Insurance",13213]
[5145,"Ainsworth, Jacob (5145) 15%",5145,500,null,"Prepaid Insurance",13210]
[5146,"Mathew, Subhash (5146) 15%",5146,500,null,"Prepaid Medical Insurance",13211]
[5147,"Dugo, John & Janet (5147) min rep 15%",5147,500,null,"Prepaid Other",13240]
[5148,"Goddard, Janice (5148) min rep 15%",5148,500,null,"Prepaid Rent",13230]
[5150,"50th Anniversary Fundraising Init. (5150) 25%",5150,500,null,"Prepaid Term Life Insurance",13216]
[5154,"Roberts, Bill & Bel (5154) 15%",5154,500,null,"Prepaid Vision Insurance",13215]
[5155,"Marques, Karol (5155) min rep 15%",5155,500,null,"PRINTING",55280]
[5156,"Arant, Julie (5156) min rep 15%",5156,500,null,"Printing - Passport",55286]
[5157,"Carlson, Kimberly (5157) 15%",5157,500,null,"Printing-Acquisition",55287]
[5158,"Boitz, Joy Alynn (Curtis) (5158) min rep 15%",5158,500,null,"Printing-Appeals",55285]
[5160,"LaShelle, Brett (5160) 15%",5160,500,null,"Printing-Marketing",55284]
[5161,"Dunne, Stephen & Lia (5161) min rep 15%",5161,500,null,"Printing-Stationery",55283]
[5162,"Thomas, William {Calen} (5162) 15%",5162,500,null,"Professional Services",55235]
[5163,"Friesen, Julie (5163) Min Rep 15%",5163,500,null,"Regional Conference Expense",50152]
[5164,"Training Conf Acct (5164) 0%",5164,500,null,"Retreat/Conference for Staff",53510]
{"$rows_left_out":559}
{"sheet":"Lookups","index":3,"n_rows":20,"n_cols":11,"rows_kept":20,"hidden":true,"merged":[[3,7,3,8],[4,5,4,6],[5,5,5,6],[6,7,6,8],[7,5,7,6],[8,5,8,6]]}
[]
[]
[]
[{"$nulls":7},"number value"]
[{"$nulls":4},"Date","Time",null,"time","date"]
[{"$nulls":3},"deadline date",{"$f":"IF(datefilledouttext=\"Thursday\",datefilledout+6,IF(datefilledouttext=\"Friday\",datefilledout+5,IF(datefilledouttext=\"Saturday\",datefilledout+4,IF(datefilledouttext=\"Sunday\",datefilledout+3,IF(datefilledouttext=\"Monday\",datefilledout+2,IF(datefilledouttext=\"Tuesday\",datefilledout+1,datefilledout))))))","v":"2019-08-21"},"12:00:00",null,{"$f":"_xlfn.NUMBERVALUE(deadlinetime)","v":{"v":0.5,"d":"0.500000"}},{"$f":"_xlfn.NUMBERVALUE(deadlinedate)","v":{"v":43698,"d":"43698.000000"}},{"$f":"TEXT(deadlinedate,\"DDDD\")","v":"Wednesday"},{"$f":"deadlinetime","v":0.5}]
[{"$nulls":3},"date filled out",{"$f":"IF(OR(Date_Filed<>\"\",Date_Filed>0),Date_Filed,IF(OR(Due_Date<>\"\",Due_Date>0),Due_Date,E9))","v":"2019-08-15"},null,null,{"$f":"deadlinetimenumber+deadlinedatenumber","v":43698.5},null,{"$f":"TEXT(datefilledout,\"DDDD\")","v":"Thursday"}]
[{"$nulls":3},"due date",{"$f":"Due_Date","v":"00:00:00"},{"$f":"ROUND((H7-H9),2)*24&\" hrs\"","v":"144.96 hrs"},{"$nulls":3},{"$f":"Due_Date","v":"00:00:00"},100]
[{"$nulls":3},"today",{"$f":"TODAY()","v":"2019-08-15"},{"$f":"NOW()","v":43692.46481967592},null,{"$f":"_xlfn.NUMBERVALUE(currenttime)","v":43692.4648196759},null,{"$f":"E9","v":"2019-08-15"},200]
[{"$nulls":10},220]
[{"$nulls":10},300]
[{"$nulls":10},501]
[]
[]
[]
[{"$nulls":4},"(Please choose one)",null,null,{"$f":"IF(datefilledouttext<>\"wednesday\",\"The deadline for A/P vendor payments is \"&TEXT(deadlinedate,\"DDDD MMM DD\")&\" at noon.\",H18)","v":"The deadline for A/P vendor payments is Wednesday Aug 21 at noon."}]
[{"$nulls":4},"Check"]
[{"$nulls":4},"ACH",null,null,{"$f":"IF(AND(datefilledouttext=\"Wednesday\",currenttimenumber<H7),\"You only have \"&F8&\" to submit your request\",\"You have missed the deadline for this week.\")","v":"You have missed the deadline for this week."}]
[{"$nulls":4},"Direct Deposit"]
[{"$nulls":4},"Wire",null,null,{"$f":"IF(AND(datefilledouttext=\"Wednesday\",currenttimenumber<deadlinetimenumber+deadlinedatenumber),\"You only have \"&F8&\" to submit your request\",\"You have missed the deadline for this week.\")","v":"You have missed the deadline for this week."}]