{"text_format":"3","workbook":"xlsx","n_sheets":4,"sheets":["requisition form","back up docs","projects","Lookups"],"not_rendered":{"defined_names":17},"read":"whole","date_system":"1900"}

{"sheet":"requisition form","index":0,"n_rows":45,"n_cols":14,"rows_kept":45,"merged":[[1,0,1,4],[1,5,1,9],[2,12,2,13],[3,2,3,3],[3,4,3,5],[3,7,3,9],[4,0,5,0],[4,1,5,5],[4,7,4,9],[4,12,4,14],[5,7,5,9],[6,0,9,0],[6,1,6,5],[6,7,6,9],[7,1,7,5],[7,7,7,9],[8,1,8,5],[8,7,8,9],[9,1,9,5],[9,7,9,9],[11,1,11,9],[14,0,14,2],[15,0,15,2],[16,0,16,2],[17,0,17,2],[18,0,18,2],[19,0,19,2],[20,0,20,2],[21,0,21,2],[22,0,22,2],[23,0,23,2],[24,0,24,2],[25,0,25,2],[26,0,26,2],[27,0,27,2],[28,0,28,2],[29,0,29,2],[30,0,30,2],[31,0,31,2],[32,0,32,2],[33,0,33,2],[34,0,34,2],[35,0,35,2],[37,0,37,3],[38,0,38,3],[39,0,39,3],[40,0,40,3],[41,0,41,3],[42,0,42,3],[43,0,43,3]]}
["ISI Requisition Form"]
[{"$f":"Lookups!H16","v":"The deadline for A/P vendor payments is Wednesday Aug 21 at noon."},{"$nulls":4},"Paste backup documentation on backup up docs tab. Email/scan to requisitions@isionline.org",{"$nulls":5},"date filled out",{"$f":"datefilledout","v":"2019-08-15"},{"$f":"TEXT(datefilledout,\"DDDD\")","v":"Thursday"}]
["Yellow spaces must be filled in to be accepted, Green spaces are for Finance use only.",{"$nulls":10},"current time",{"$f":"currenttime","v":43692.46481967592}]
["Date (mm/dd/yy)",null,"Charge To",null,{"$f":"VLOOKUP(F15,Fund_codes,2,)","v":" "},null,"Batch #:",{"$nulls":4},"deadline time",{"$f":"deadlinetime","v":"12:00:00"}]
["Special Instructions (i.e. \"Return Check to Requestor\")",{"$nulls":5},"Date Pd:",{"$nulls":4},"due date",{"$f":"duedate","v":{"$error":"#NAME?"}}]
[{"$nulls":6},"Optional Invoice #",{"$nulls":5},{"$f":"VLOOKUP(duedate,Deadlines,3,TRUE)","v":{"$error":"#NAME?"}}]
["PAY     TO",{"$nulls":5},"Requisition #",{"$f":"UPPER(LEFT(B7,3)&RIGHT(B7,2)&IF(Due_Date>0,Due_Date,IF(OR(Date_Filed<>\"\",Date_Filed>0),Date_Filed,TODAY())))","v":"43692"}]
[{"$nulls":6},"Requested By:"]
[{"$nulls":6},"Date Needed"]
[{"$nulls":6},"Payment Type","(Please choose one)"]
[{"$nulls":11},{"$f":"_xlfn.IFNA(IF(D15=300,\"Tovar\",IF(D15=500,\"\",VLOOKUP(F15,projects!I6:J34,2,))),\"\")","v":""}]
["Additional Comments"]
[]
["Description Written on Check Stub",null,null,"Fund","Expense Code","Project/Dept","Qty","Unit Price",null,"Subtotal"]
[" ",null,null,{"$f":"_xlfn.IFNA(VLOOKUP(F15,Fund_codes,4,),\"\")","v":0},{"$f":"VLOOKUP(E16,GLcodes,2,)","v":" "}," ",{"$nulls":3},{"$f":"IF($H$9=\"\",\"Enter Date Needed\",H15*G15)","v":"Enter Date Needed"}]
[{"$f":"IF(AND(E15<30000,$E$4>0),\"Please talk with Finance\",\"\")","v":""},{"$nulls":3},"If code unknown, lookup here.","If Dept unknown, lookup here"]
[{"$nulls":3},{"$f":"_xlfn.IFNA(VLOOKUP(F17,Fund_codes,4,),\"\")","v":0},{"$f":"VLOOKUP(E18,GLcodes,2,)","v":" "}," ",{"$nulls":3},{"$f":"IF($H$9=\"\",\"Enter Date Needed\",H17*G17)","v":"Enter Date Needed"}]
[{"$f":"IF(AND(E17<30000,$E$4>0),\"Please talk with Finance\",\"\")","v":""},{"$nulls":3},"If code unknown, lookup here.","If Dept unknown, lookup here"]
[{"$nulls":3},{"$f":"_xlfn.IFNA(VLOOKUP(F19,Fund_codes,4,),\"\")","v":0},{"$f":"VLOOKUP(E20,GLcodes,2,)","v":" "}," ",{"$nulls":3},{"$f":"IF($H$9=\"\",\"Enter Date Needed\",H19*G19)","v":"Enter Date Needed"}]
[{"$f":"IF(AND(E19<30000,$E$4>0),\"Please talk with Finance\",\"\")","v":""},{"$nulls":3},"If code unknown, lookup here.","If Dept unknown, lookup here"]
[{"$nulls":3},{"$f":"_xlfn.IFNA(VLOOKUP(F21,Fund_codes,4,),\"\")","v":0},{"$f":"VLOOKUP(E22,GLcodes,2,)","v":" "}," ",{"$nulls":3},{"$f":"IF($H$9=\"\",\"Enter Date Needed\",H21*G21)","v":"Enter Date Needed"}]
[{"$f":"IF(AND(E21<30000,$E$4>0),\"Please talk with Finance\",\"\")","v":""},{"$nulls":3},"If code unknown, lookup here.","If Dept unknown, lookup here"]
[{"$nulls":3},{"$f":"_xlfn.IFNA(VLOOKUP(F23,Fund_codes,4,),\"\")","v":0},{"$f":"VLOOKUP(E24,GLcodes,2,)","v":" "}," ",{"$nulls":3},{"$f":"IF($H$9=\"\",\"Enter Date Needed\",H23*G23)","v":"Enter Date Needed"}]
[{"$f":"IF(AND(E23<30000,$E$4>0),\"Please talk with Finance\",\"\")","v":""},{"$nulls":3},"If code unknown, lookup here.","If Dept unknown, lookup here"]
[{"$nulls":3},{"$f":"_xlfn.IFNA(VLOOKUP(F25,Fund_codes,4,),\"\")","v":0},{"$f":"VLOOKUP(E26,GLcodes,2,)","v":" "}," ",{"$nulls":3},{"$f":"IF($H$9=\"\",\"Enter Date Needed\",H25*G25)","v":"Enter Date Needed"}]
[{"$f":"IF(AND(E25<30000,$E$4>0),\"Please talk with Finance\",\"\")","v":""},{"$nulls":3},"If code unknown, lookup here.","If Dept unknown, lookup here"]
[{"$nulls":3},{"$f":"_xlfn.IFNA(VLOOKUP(F27,Fund_codes,4,),\"\")","v":0},{"$f":"VLOOKUP(E28,GLcodes,2,)","v":" "}," ",{"$nulls":3},{"$f":"IF($H$9=\"\",\"Enter Date Needed\",H27*G27)","v":"Enter Date Needed"}]
[{"$f":"IF(AND(E27<30000,$E$4>0),\"Please talk with Finance\",\"\")","v":""},{"$nulls":3},"If code unknown, lookup here.","If Dept unknown, lookup here"]
[{"$nulls":3},{"$f":"_xlfn.IFNA(VLOOKUP(F29,Fund_codes,4,),\"\")","v":0},{"$f":"VLOOKUP(E30,GLcodes,2,)","v":" "}," ",{"$nulls":3},{"$f":"IF($H$9=\"\",\"Enter Date Needed\",H29*G29)","v":"Enter Date Needed"}]
[{"$f":"IF(AND(E29<30000,$E$4>0),\"Please talk with Finance\",\"\")","v":""},{"$nulls":3},"If code unknown, lookup here.","If Dept unknown, lookup here"]
[{"$nulls":3},{"$f":"_xlfn.IFNA(VLOOKUP(F31,Fund_codes,4,),\"\")","v":0},{"$f":"VLOOKUP(E32,GLcodes,2,)","v":" "}," ",{"$nulls":3},{"$f":"IF($H$9=\"\",\"Enter Date Needed\",H31*G31)","v":"Enter Date Needed"}]
[{"$f":"IF(AND(E31<30000,$E$4>0),\"Please talk with Finance\",\"\")","v":""},{"$nulls":3},"If code unknown, lookup here.","If Dept unknown, lookup here"]
[{"$nulls":3},{"$f":"_xlfn.IFNA(VLOOKUP(F33,Fund_codes,4,),\"\")","v":0},{"$f":"VLOOKUP(E34,GLcodes,2,)","v":" "}," ",{"$nulls":3},{"$f":"IF($H$9=\"\",\"Enter Date Needed\",H33*G33)","v":"Enter Date Needed"}]
[{"$f":"IF(AND(E33<30000,$E$4>0),\"Please talk with Finance\",\"\")","v":""},{"$nulls":3},"If code unknown, lookup here.","If Dept unknown, lookup here"]
[{"$nulls":3},{"$f":"_xlfn.IFNA(VLOOKUP(F35,Fund_codes,4,),\"\")","v":0},{"$f":"VLOOKUP(E36,GLcodes,2,)","v":" "}," ",{"$nulls":3},{"$f":"IF($H$9=\"\",\"Enter Date Needed\",H35*G35)","v":"Enter Date Needed"}]
[{"$f":"IF(AND(E35<30000,$E$4>0),\"Please talk with Finance\",\"\")","v":""},{"$nulls":3},"If code unknown, lookup here.","If Dept unknown, lookup here"]
[{"$nulls":5},"Total",{"$nulls":3},{"$f":"SUM(J15:J36)","v":0}]
["Approval Signatures -- Per Signature Authorization List"]
[{"$f":"\"Department Supervisor - \"&L11","v":"Department Supervisor - "},{"$nulls":3},"Once filled out this should be emailed to supervisor"]
[{"$nulls":4},"who approves it and then emails it to Finance Dept"]
["Finance Dept Approval"]
[{"$nulls":4},"Any supporting documents should be scanned and"]
["Executive Office",{"$nulls":3},"attached (or pasted) with this document to all parties"]
[]
["Updated 08/15/2019"]

{"sheet":"back up docs","index":1,"n_rows":164,"n_cols":20,"rows_kept":164}
{"$rows_empty":163}
[{"$nulls":19},"."]

{"sheet":"projects","index":2,"n_rows":678,"n_cols":10,"rows_kept":678}
["Account Code","Account Title","dept","fund",null,"If code unknown, lookup here."," "]
[null,"If Dept unknown, lookup here"]
[" "," "]
[1100,"Executive Office (1100) 0%",{"$f":"A4","v":1100},100]
[1101,"President's Contingency (1101) 0%",1101,100,null,"A/P to Ltd",24131]
[1503,"Lahart Trust (1503) 0%",1503,500,null,"Account Receivable - pledged donations",14150,null,1100,"Shaw"]
[1600,"Land Acquisition (1600) 0%",1600,300,null,"Accounts Receivable",14130,null,1101,"Shaw"]
[2101,"Ministry Department (2101) 0% {Tovar}",2101,100,null,"Accounts Receivable - ISILtd",14131,null,1503,"Tovar"]
[2102,"National Training Department (2102) 0% {Decker}",2102,100,null,"Accounts Receivable - ISIntl",14132,null,1600,"Tovar"]
[2104,"People Services (2104) 0% {Bolton}",2104,100,null,"Accounts Receivable-NSF Checks",14145,null,2101,"Decker"]
[2301,"Western Region  (2301) 0% {Zeigler}",2301,100,null,"Accumulated Depreciation",16900,null,2102,"Decker"]
[2302,"SE / Great Lakes Region (2302) 0% {Germann}",2302,100,null,"Advertising",55100,null,2104,"Bolton"]
[2303,"RM & Plains Region (2303) 0% {Yabuki}",2303,100,null,"Annual Audit - Capin Crouse",55233,null,2301,"Zeigler"]
[2304,"Director of Field Development (2304) 0% {Townsend}",2304,100,null,"Bank Charges",56150,null,2302,"Germann"]
[2306,"Northeastern Region (2306) 10% {Larson}",2306,100,null,"Bankers Life & Casualty (220047932",11208,null,2303,"Yabuki"]
[2307,"Research and Innovation (2307) {jackson}",2307,100,null,"Benevolence",55145,null,2304,"Townsend"]
[2500,"Global Ministries (2500) {crowell, g}",2500,100,null,"Board Meeting Expense",53515,null,2306,"Larson"]
[2510,"ISnt'l Singapore (2510) 0%",2510,100,null,"Board of Trustees Expense",55120,null,2307,"jackson"]
[2530,"IS International Misc Countries (2530) 0%",2530,500,null,"Building Improvements",16250,null,2500,"prensner"]
[2600,"Web site/Publications (2600) 0% {MillerR}",2600,100,null,"Building Improvements",16251,null,2510,"Tovar"]
[3000,"Building (3000) 0%",3000,100,null,"Business Meetings",53200,null,2520,"Tovar"]
[3100,"Operations (3100) 0%",3100,100,null,"Cash Advance - Field Staff Projects",53105,null,2530,"Tovar"]
[3111,"Western Region (3111) 10% {zeigler}",3111,500,null,"Cash Advance - Home Office",14120,null,2600,"MillerR"]
[3112,"Rocky Mtn Region (3112) 10% {Yabuki}",3112,500,null,"Cellular Phone Charges",55311,null,3000,"Tovar"]
[3115,"Northeastern Reg (3115) 10% {Larson}",3115,500,null,"Cobra Liability Payments (Med/Dent)",21150,null,3100,"Tovar"]
[3116,"Northwestern Reg (3116) 10% {Germann}",3116,500,null,"Coffee Supplies",55224,null,3111,"zeigler"]
[3117,"SE & Great Lakes Region (3117) 10% {Germann}",3117,500,null,"Computer Equipment",16400,null,3112,"Yabuki"]
[3150,"Expansion & Recruitment (3150) 0%",3150,100,null,"Computer On-Line Service",55130,null,3115,"Larson"]
[3200,"Finance (3200) 0% {Spengler}",3200,100,null,"Computer Purchase",55175,null,3116,"Germann"]
[3290,"Interest/Div Income (3290) 0%",3290,100,null,"Computer Software",16450,null,3117,"Germann"]
[3300,"Ministry Advancement  (3300) 0% {Holland}",3300,100,null,"Computer Support",55135,null,3150,"Decker"]
[3301,"San Diego Launch Initiatives (3301) 0%",3301,100,null,"Constructioin in Progress",16240,null,3200,"Spengler"]
[3302,"Houston Launch Initiatives (3302) 0%",3302,100,null,"Contingency",56460,null,3290,"Spengler"]
[3303,"NMF Major Donor Days (3303) 0%",3303,100,null,"Contract - Annual Equip Maint",55201,null,3300,"Holland"]
[5001,"Ithica NY (5001) 15% {larson}",5001,500,null,"Contracts-Maintenance",55200]
[5002,"Western NY & PA Event (5002) 10% {larson}",5002,500,null,"CPA/Prof Financial Assistance",55232]
[5003,"Monmouth OR City (5003) 15% {Zeigler}",5003,500,null,"Deposits on Contracts",53505]
[5004,"NE Regional Mobilization  (5004) 15% {Cossette}",5004,500,null,"Disaster Recovery Cost",56465]
[5005,"Evangeline Tharp Mem. Fnd (5005) 10% {Depalatis}",5005,500,null,"Displays",54120]
[5006,"Auraria Ministry (5006) 15% {Mills}",5006,500,null,"Donations",55140]
[5007,"Lincoln NE City (5007) 15% {Spaulding}",5007,500,null,"Donor Appreciation Gifts",55300]
[5008,"Bloomington/Normal, Illinois (5008) 15% {berger}",5008,500,null,"Dues & Subscriptions",55150]
[5009,"KC Fund Raise Event (5009) 10% {douglass}",5009,500,null,"ECCU Savings Account",11209]
[5010,"Colorado Springs Retreat  (5010) 15% {halverson}",5010,500,null,"ECCU-Canadian Donations to ISI",11210]
[5011,"San Francisco City (5011) 15% {Thomas C}",5011,500,null,"ECCU-General Fund",11204]
[5012,"Northridge Area, CA (5012) 15% {Downs}",5012,500,null,"Facility Rental",52310]
[5013,"West/Cent NY & West PA (5013) 15% {larson}",5013,500,null,"Field Conferences/Banquets",54130]
[5014,"Western Massachusetts Area (5014) 15% {S. Hope}",5014,500,null,"Field Staff Materials",50141]
[5015,"Bloomington, IN Special (5015) 10% {hawes}",5015,500,null,"Field Staff Postage",50140]
[5016,"Santz Cruz Events (5016) 5%5% {pollard}",5016,500,null,"Field Staff Stationery",50142]
[5017,"Iowa City (5017) 15% {younkin}",5017,500,null,"Furniture & Equipment",16300]
[5018,"Northern Cal Student Activity (5018) 15% {Pollard}",5018,500,null,"Graphics",55262]
[5019,"Northridge, CA Events (5019) 10% {downs}",5019,500,null,"Graphics-Appeal Letter",55261]
[5020,"Purdue University IN (5020) 15% {zull}",5020,500,null,"Graphics-Passport",55260]
[5021,"Fayetteville City (5021) 15% {yabuki}",5021,500,null,"HO Office Lease CAM Charges",52305]
[5022,"Tyler Tx (5022) 15% {Lindvall}",5022,500,null,"Home Office Fixed Assets",50114]
[5023,"Sout Bay Pennisula CA  (5023) 15% {Zeigler}",5023,500,null,"Honorariums - Nonemployees",51145]
[5024,"Tempe Grad Ministry (5024) 15% {peterson}",5024,500,null,"Honorariums - Employees",17130]
[5025,"Eugene Events (5025) 5%-5% {Smucker}",5025,500,null,"Insurance - Cyber/Web Liability",52140]
[5026,"Durham City Student Activity (5026) 15% {Kronstad}",5026,500,null,"Insurance - International",52130]
[5027,"ID/MT Area Mobilization (5027) 15% {Spady}",5027,500,null,"Insurance - Lawyer-s Prof",52110]
[5028,"Greely CO (5028) 15% {Shelley}",5028,500,null,"Insurance - Officers/Directors",52120]
[5029,"New Brunswick, NJ City (5029) 15% {mannon}",5029,500,null,"Insurance-Liability & Property",52100]
[5030,"NE Region TRUE Retreats (5030) 10% {larson}",5030,500,null,"Intercompany Transfers",60010]
[5031,"Wichita Activity Acct (5031) 15% {allen}",5031,500,null,"Internet Connect Fees",55315]
[5033,"Philadelphia City (5033) 15% {Newbrander}",5033,500,null,"Janitorial",55245]
[5034,"Reno City Account (5034) 15% {Cutler}",5034,500,null,"Lease Equipment-PRINTERS",55161]
[5035,"Hope Special (5035) 10%",{"$f":"A68","v":5035},500,null,"Leased Equipment",55160]
[5036,"Cossette Special (5036) 10%",5036,500,null,"Legal fees - normal issues",55234]
[5037,"Miller RG Special (5037) 10%",5037,500,null,"Literature Production",54140]
[5038,"Stillwater, OK (5038) 15%",5038,500,null,"Literature Purchases",54150]
[5039,"Northern NJ Area (5039) 15% {Innis}",5039,500,null,"Maintenance",52200]
[5040,"Western Region True Retreat (5040) 15%",5040,500,null,"Materials for Ministry",54110]
[5041,"Urbana/Champaign, IL (5041) 15% {Krehbeil}",5041,500,null,"Meetings & Seminars",53500]
[5042,"Boyle C Special (5042) 10%",5042,500,null,"Mileage Expense",55110]
[5043,"Blacksburg VA (5043) 15%",5043,500,null,"Ministry Initiatives",53000]
[5044,"Newark, DE (5044) 15% {Larson}",5044,500,null,"Ministry/Organization Support",55141]
[5045,"Shelley Special (5045) 10%",5045,500,null,"Minor Capital",55170]
[5046,"Cox Special (5046) 10%",5046,500,null,"Miscellanous",55210]
[5047,"Richland College, TX (5047) 15% {christofer}",5047,500,null,"Moving Expenses",55219]
[5048,"Colo Spgs Fund Event (5048) 5%5% {halverson}",5048,500,null,"Nat-l Staff Conference Expense",53201]
[5059,"Undergraduate Ministries AZ",5059,500,null,"NSO Fees",50150]
[5060,"Disaster Relief Fund (5060) 25%",5060,200,null,"New Staff Orientation Fees",55216]
[5061,"Charlottesville, VA (5061) 15%",5061,500,null,"Newsletter/Passport",55293]
[5062,"Ingram Special (5062) 10%",5062,500,null,"NSC Attendance",55215]
[5075,"Top Strategic Initiative (5075) 25%",5075,500,null,"NSC fees",50151]
[5080,"ISI Global Impact Initiatives (5080) 25%",5080,500,null,"Office Rent",52300]
[5097,"Bevan Special (5097) 10%",5097,500,null,"Office Supplies - Copy Paper",55220]
[5098,"Halverson Special (5098) 10%",5098,500,null,"Office Supplies - Package/Ship",55222]
[5101,"India/China Outreach (5101) 25%",5101,300,null,"Office Supplies - Toner Produc",55221]
[5105,"National Staff Conference (5105) 0%",5105,200,null,"Office Supplies-General",55230]
[5111,"Ponten, Mary Jane (5111)8.5%",5111,500,null,"Outreach",55411]
[5127,"Parkins, Daniel (5127) 15%",5127,500,null,"Outside Professional Fees",55290]
[5129,"China Ministries (5129) 25%",5129,300,null,"Outside Storage Rental",52301]
[5130,"Nat Dir Fld Team Min (5130) 15%",5130,500,null,"Payments to Annuitants",56110]
[5132,"Equip Initiatives (5132) 25%",5132,200,null,"Penalties - sales/payroll/tax/etc",56190]
[5134,"Orientation/Training (5134) 0% {Decker}",5134,200,null,"Petty Cash",11100]
[5136,"Pearce, Andy (5136) 15%",5136,500,null,"Photocopying",55250]
[5137,"Pearce Special (5137) 10%",5137,500,null,"Postage",55270]
[5138,"Congdon Special (5138)10%",5138,500,null,"Postage - Appeal",55275]
[5139,"Congdon, Gene & Patti (5139) 15%",5139,500,null,"Postage - Passport",55274]
[5141,"Alumbaugh, Jon & Ruth (5141) min rep 15%",5141,500,null,"Postage-Acquisition",55276]
[5142,"Kaneshiro, Melanie (5142) MR 15%",5142,500,null,"POSTAGE-RECEIPTS",55273]
[5143,"Jackson, Sandra & Bob (5143) 15%",5143,500,null,"Prepaid Dental Insurance",13212]
[5144,"Daniel, Kimberly (5144) 15%",5144,500,null,"Prepaid Disability Insurance",13213]
[5145,"Ainsworth, Jacob (5145) 15%",5145,500,null,"Prepaid Insurance",13210]
[5146,"Mathew, Subhash (5146) 15%",5146,500,null,"Prepaid Medical Insurance",13211]
[5147,"Dugo, John & Janet (5147) min rep 15%",5147,500,null,"Prepaid Other",13240]
[5148,"Goddard, Janice (5148) min rep 15%",5148,500,null,"Prepaid Rent",13230]
[5150,"50th Anniversary Fundraising Init. (5150) 25%",5150,500,null,"Prepaid Term Life Insurance",13216]
[5154,"Roberts, Bill & Bel (5154) 15%",5154,500,null,"Prepaid Vision Insurance",13215]
[5155,"Marques, Karol (5155) min rep 15%",5155,500,null,"PRINTING",55280]
[5156,"Arant, Julie (5156) min rep 15%",5156,500,null,"Printing - Passport",55286]
[5157,"Carlson, Kimberly (5157) 15%",5157,500,null,"Printing-Acquisition",55287]
[5158,"Boitz, Joy Alynn (Curtis) (5158) min rep 15%",5158,500,null,"Printing-Appeals",55285]
[5160,"LaShelle, Brett (5160) 15%",5160,500,null,"Printing-Marketing",55284]
[5161,"Dunne, Stephen & Lia (5161) min rep 15%",5161,500,null,"Printing-Stationery",55283]
[5162,"Thomas, William {Calen} (5162) 15%",5162,500,null,"Professional Services",55235]
[5163,"Friesen, Julie (5163) Min Rep 15%",5163,500,null,"Regional Conference Expense",50152]
[5164,"Training Conf Acct (5164) 0%",5164,500,null,"Retreat/Conference for Staff",53510]
[5165,"Leadership Develoment (5165) 25%",5165,200,null,"Sales Tax",52250]
[5166,"Nat'l Trng Acct Decker (5166) 0%",5166,500,null,"SCB Hong Kong, HK$",11320]
[5167,"Zhang, Abraham (5167) 15%",5167,500,null,"SCB Hong Kong, US$",11330]
[5168,"Larson, Ruth (5168) min rep 15%",5168,500,null,"Secondments Expense",55296]
[5170,"Spaulding, Ron & Judy (5170) 15%",5170,500,null,"Security Deposits",14135]
[5171,"Spaulding Special (5171) 10%",5171,500,null,"Staff Care / Gifts",51322]
[5174,"Frahm, George (5174) min rep 15%",5174,500,null,"Staff Prayer Letter",50143]
[5175,"Fannin, Kevin & Heather (5175) 15%",5175,500,null,"Standard Charter Bank -- Singapore S$",11310]
[5176,"Fannin Special (5176) 10%",5176,500,null,"Standard Charter Bank -- Singapore US$",11300]
[5177,"Udoko, Nsima (5177) 15%",5177,500,null,"Supplies - Janitorial",55223]
[5178,"Braintwain, Steve (5178) 15%",5178,500,null,"Supplies-Maintenance",55240]
[5179,"Braintwain Special (5179) 10%",5179,500,null,"TEAM - secondment expenses",55297]
[5180,"Eilers, Marc (5180) 15%",5180,500,null,"Telephone",55310]
[5181,"Kim, In Cheol {Aquila} (5181) 15%",{"$f":"A134","v":5181},500,null,"Telephone - 800 Line",55320]
[5183,"Ng, Boon-Kjhai (5183) 15%",5183,500,null,"Training/Education",55291]
[5184,"Hayzlett, Paul & Susan (5184) 15%",5184,500,null,"Transfer From Escrow Acct",60005]
[5185,"Mac, TK & Elizabeth",5185,500,null,"Transfer from Subsidiary Company",60015]
[5189,"Jonsson, Nancy (5189) 15%",5189,500,null,"Transfer into Escrow Acct",60000]
[5190,"Curtis, Tyler (5190) 15%",5190,500,null,"Travel-Airfare",53110]
[5192,"Compton, Laura (5192)  15%",5192,500,null,"Travel-Auto Rental",53120]
[5193,"Compton Special (5193) 10%",5193,500,null,"Travel-Food & Lodging",53130]
[5195,"Kershaw, Pat (5195) 8.5%",5195,500,null,"Travel-Miscellaneous",53140]
[5196,"Jang, Norm (5196) 15% Min Rep",5196,500,null,"Utilities",52400]
[5197,"Woods, Scott (5197) Min Rep 15%",5197,500,null,"Video Production",54142]
[5198,"Halverson, Dean (5198) 10%",5198,500,null,"Visa Expense to be reclaseed",53101]
[5199,"Huff, Dana [Russell] (5199) 15%",5199,500,null,"Vision Weekends",55410]
[5200,"ESL/CSL Program (5200) 25%",5200,500,null,"Web Site Charges",50144]
[5201,"Board of Trustees (5201) 0%",5201,500,null,"Web Site Expenses",55138]
[5202,"Ft. Collins Student Scholarships (5202) 0%",5202,500,null,"Wells Fargo - ISInt'l 5839568788",11207]
[5205,"Benevolence Fund (5205) 0%",5205,300,null,"Wells Fargo Checking -- US 6495228899",11205]
[5206,"Dumaresq, Rachel (5206)15%",5206,500,null,"Wells Fargo-Canadian 6495228923",11206]
[5208,"Sodergren, David (5208) 15%",5208,500,null,"WF Registration PayPal (6019907549)",11211]
[5209,"Sodergren, Special (5209) 10%",5209,500,null,"NSC -Audio/Video Taping-Misc",60980]
[5210,"Apgar, Don & Sue (5210) 15%",5210,500,null,"NSC -Audio/Video Taping-O/S Prof",60950]
[5211,"Apgar Special (5211) 10%",5211,500,null,"NSC -Audio/Video Taping-Tape Dup",60965]
[5212,"Kronstad, Daniel (5212) 15%",5212,500,null,"NSC -Banner/Dec/Sign-Graphics",60600]
[5213,"Kronstad Special (5213) 15%",5213,500,null,"NSC -Banner/Dec/Sign-Production",60605]
[5214,"Gray, Mark (5214) 15%",5214,500,null,"NSC -Campus Staff Svc Rep",62065]
[5215,"Gray Special (5215) 10%",5215,500,null,"NSC -Conf Staff-Air Transport",60100]
[5216,"Frost, John & Carolyn (5216) 15%",5216,500,null,"NSC -Conf Staff-Ground Transport",60105]
[5217,"van Ouwerkerk, Ed & Margreet (5217) 15%",5217,500,null,"NSC -Conf Staff-Housing",60110]
[5218,"Wolf, Charles (5218) 15%",5218,500,null,"NSC -Conf Staff-Meals",60115]
[5219,"Mitchell, Jill (5219) min rep 15%",5219,500,null,"NSC -Conf Staff-Miscellaneous",60130]
[5220,"Hawes, Randy (5220) 15%",5220,500,null,"NSC -Conf Staff-Salary",60125]
[5221,"Thomas, Erv & Jane (5221) 15%",5221,500,null,"NSC -Conf Staff-Sightseeing",60120]
[5222,"Wilson, Ben & Rachel (5222) 15%",5222,500,null,"NSC -Conferee Brochure-Graphics",60200]
[5224,"Trautman, Connie (5224) min rep 15%",5224,500,null,"NSC -Conferee Brochure-Misc",60225]
[5225,"Chun, David (5225) 15%",5225,500,null,"NSC -Conferee Brochure-Postage",60220]
[5226,"Voth, Lisa (5226) 15%",5226,500,null,"NSC -Conferee Brochure-Printing",60205]
[5227,"Stewart, Jerilyn (5227) min rep15%",5227,500,null,"NSC -Conferee Brochure-Translation",60210]
[5231,"Foti, Vicky (5231) 15%",5231,500,null,"NSC -Conferee Gifts-Logo Gifts",60750]
[5232,"Ghimire, Ashok & Sabina (5232) 15%",5232,500,null,"NSC -Conferee Gifts-Materials Packs",60755]
[5235,"Olson, Joahua (5235) 15%",5235,500,null,"NSC -Conferee Gifts-Other",60760]
[5237,"van Ouwerkerk Special (5237) 10%",5237,500,null,"NSC -Conferees-Sightseeing",60020]
[5238,"Casper, Hollie & Jason  (5238) 15%",5238,500,null,"NSC -Equipment Needs-Book/Paper Res",60660]
[5239,"Ehman, Ginger (5239) 15%",5239,500,null,"NSC -Equipment Needs-Comm Devices",60670]
[5240,"Canada Office (5240) 5%",5240,500,null,"NSC -Equipment Needs-Hardware",60650]
[5242,"India Project (5242) 25%",5242,300,null,"NSC -Equipment Needs-Office Machine",60675]
[5243,"Campus Outreach Program (5243) 25%",5243,500,null,"NSC -Equipment Needs-Other",60680]
[5244,"Level A Strategic Ministry Initiatives (5244) 0%",5244,500,null,"NSC -Equipment Needs-Training",60665]
[5245,"Affil/Assoc (5245) 25% {ops}",5245,300,null,"NSC -Fin Supp Matl-Graphics",60300]
[5249,"Development and Mobilization (5249) 25%",5249,200,null,"NSC -Fin Supp Matl-Printing",60305]
[5250,"Outreach to Intl (5250) 0%",5250,100,null,"NSC -Follow Up-Air Transport",60870]
[5255,"Allocated Distribution Fund (5255) 15%",5255,500,null,"NSC -Follow Up-Copy/Print",60890]
[5259,"Expanding Church Mobilize Initiative (5259) 25%",5259,300,null,"NSC -Follow Up-Materials Purchased",60855]
[5260,"Livingston, John (5260) 15%",5260,500,null,"NSC -Follow Up-Meals",60875]
[5261,"Livingston Special (5261) 10%",5261,500,null,"NSC -Follow Up-Miscellaneous",60900]
[5262,"Lahti, Kristen (5262) 15%",5262,500,null,"NSC -Follow Up-Telephone",60860]
[5263,"Hakes, Hannah (5263) 15%",5263,500,null,"NSC -Fund Dev-Air Transport",60800]
[5265,"Jesus Video Project (5265) 25%",5265,300,null,"NSC -Fund Dev-Ground Transport",60815]
[5266,"More Than a Carpenter (5265) 0%",5266,500,null,"NSC -Fund Dev-Housing",60805]
[5268,"Web Marketing Project (Pardot) 25%",5268,500,null,"NSC -Fund Dev-Meals",60810]
[5269,"Pacific Northwest Initiatives (5269) 25%",5269,300,null,"NSC -Fund Dev-Miscellaneous",60835]
[5270,"Dev Director Ops Exp (5270) 0%",5270,500,null,"NSC -Host Fam Recruit-Copy/Print",60475]
[5271,"Dunne Special (5271) 10%",5271,500,null,"NSC -Host Fam Recruit-Grnd Trnsport",60465]
[5273,"CFM Film Distribution/Parnership (5273) 25%",5273,500,null,"NSC -Host Fam Recruit-Housing",60455]
[5275,"Training Initiatives (5275) 25%",5275,300,null,"NSC -Host Fam Recruit-Meals",60460]
[5276,"M28 Initiatives (5276) 25%",5276,200,null,"NSC -Prayer Support Matl-Misc",60275]
[5278,"Hindu Student Outreach Initiative (5275) 25%",5278,500,null,"NSC -Prayer Support Matl-Printing",60255]
[5280,"Mission America Rec (5280) 0%",5280,500,null,"NSC -Prayer Support Matl-Supplies",60265]
[5281,"Personalysis (5281) LM Rest 15%",5281,500,null,"NSC -Pre-Conf/Conf Log-Air Trnsport",60550]
[5282,"TRUE Leadership Retreats (5282) 25%",5282,500,null,"NSC -Pre-Conf/Conf Log-Grnd Trnsprt",60565]
[5284,"Outreach and Technology (5284) 25%",5284,200,null,"NSC -Pre-Conf/Conf Log-Housing",60555]
[5287,"CEO Transition Fund",5287,300,null,"NSC -Pre-Conf/Conf Log-Meals",60560]
[5288,"Phase 2 Video Proj (5288) 25%",5288,500,null,"NSC -Pre-Conf/Conf Log-Misc",60590]
[5290,"CSF Muslim & Chinese Consultation (5290) 25%",{"$f":"A206","v":5290},500,null,"NSC -Pre-Conf/Conf Log-Telephone",60580]
[5291,"CSF Hindu Consultation Mtrl Dist. (5291) 25%",5291,500,null,"NSC -Prog Dev-Housing",60185]
[5293,"China Initiative - CT (5293) 25%",5293,500,null,"NSC -Prog Dev-Mat-l Purchases",60150]
[5295,"Singapore Initiative (5295) 25%",5295,500,null,"NSC -Prog Dev-Meals",60175]
[5296,"CSF Returnee Handbook - New Horizons (5296) 25%",5296,500,null,"NSC -Prog Dev-Miscellaneous",60190]
[5298,"Int'l Student Bible Study (5298) 25%",5298,300,null,"NSC -Prog Dev-Office Supplies",60180]
[5299,"Australia/New Zealand Initiatives (5299) 25%",5299,500,null,"NSC -Prog Dev-Postage",60160]
[5300,"Muslim Student Dialogue (5300) 25%",5300,500,null,"NSC -Prog Dev-Surveys",60170]
[5301,"Major Donor Events (5301) 25%",5301,500,null,"NSC -Prog Dev-Telephone",60155]
[5302,"Carlson, Joel (5302) 15%",5302,500,null,"NSC -Prog Dev-Travel",60165]
[5303,"Strat Internet Plan (5303) 0%",5303,500,null,"NSC -Program Matl-Development",60400]
[5305,"China Initiatives (5305) 25%",5305,500,null,"NSC -Program Matl-Graphics",60405]
[5306,"Hong Kong Incorporation (5306) 0%",5306,500,null,"NSC -Program Matl-Miscellaneous",60435]
[5307,"Frost, Jim (5307) 15%",5307,500,null,"NSC -Program Matl-Office Supplies",60420]
[5308,"Mdl East Dev GFUN (5308) 25%",5308,500,null,"NSC -Program Matl-Printing",60415]
[5309,"Lam, Abel Pui-Kiu & Phyllis (5309) 15%",5309,500,null,"NSC -Program Matl-Translation",60410]
[5310,"Desai Special (5310) 10%",5310,500,null,"NSC -Registration/ Credit Card Fees",60743]
[5311,"Nelson, Jeff (5311) 15%",5311,500,null,"NSC -Registration/Admin-Conf Packet",60730]
[5312,"Lasche, Joan (5312) 15%",5312,500,null,"NSC -Registration/Admin-Matl Purch",60725]
[5313,"Koester, Emily (5313) 15%",5313,500,null,"NSC -Registration/Admin-Misc",60740]
[5314,"McKain, Rebecca (5314) 15%",5314,500,null,"NSC -Registration/Admin-Office Sply",60720]
[5315,"Leung, Stephen (5315) 15%",5315,500,null,"NSC -Registration/Admin-Stickers",60735]
[5316,"Leung Special (5316) 10%",5316,500,null,"NSC -Registration/Admin-Telephone",60705]
[5317,"Akhtar, Rasheed (5317) 15%",5317,500,null,"NSC -Registration/Online Fee",60741]
[5318,"Dickinson, Bethany Special (5318) 10%",5318,500,null,"NSC -Spkr/Guests-Air Transport",60050]
[5319,"Cutler, Michael (5319) 15%",5319,500,null,"NSC -Spkr/Guests-Ground Transport",60055]
[5320,"Evans, Wendy (5320) 15%",5320,500,null,"NSC -Spkr/Guests-Honorariums",60065]
[5321,"Lindvall, Emily (5321) 15%",5321,500,null,"NSC -Spkr/Guests-Housing",60060]
[5324,"Field Staff Support Director (5324) 25%",5324,500,null,"NSC -Spkr/Guests-Meals",60070]
[5326,"Killion, Howard & Daphne(5326) 15%",5326,500,null,"NSC -Spkr/Guests-Sightseeing",60075]
[5327,"Roth, Gregory (5327) 15%",5327,500,null,"NSC -Vol Recruit-Ground Transport",60515]
[5328,"Dickinson, Bethany (5328) 15%",5328,500,null,"NSC -Vol Recruit-Meals",60510]
[5329,"Reg Inf Min Exp Rec (5329) 25%",5329,500,null,"NSC -Vol Recruit-Miscellaneous",60540]
[5330,"Schaeffer, Ava (5330) 15%",5330,500]
[5331,"Younkin, Dan (5331) 15%",5331,500]
[5332,"Kestle, Jeremy (5332) 15%",5332,500]
[5333,"Prod Displays (5333) 0%",5333,500]
[5335,"Clements, John (5335) 15%",5335,500]
[5336,"Cossette, Richard & Carol (5336) 15%",5336,500]
[5338,"Williams, David (5338) 15% Min Rep",5338,500]
[5339,"Cutler Special (5339) 10%",5339,500]
[5340,"Ritchie, Winnie (5340) 8.5%",5340,500]
[5341,"Williams, D Special (5341) 10% Min Rep",5341,500]
[5342,"Boyle, Charles & Tracey (5342) 15%",5342,500]
[5343,"Broward County (5343) 25%",5343,500]
[5345,"Steers, John & Joyce (5345) 15%",5345,500]
[5346,"Hodges, Isabel (5346) 15%",5346,500]
[5347,"Paxton Special (5347) 10%",5347,500]
[5350,"Hope, Steve & Natasha (5350) 15%",5350,500]
[5351,"Kindermann, Steve & Lisa (5351) 15%",5351,500]
[5353,"Mannon, David (5353) 15%",5353,500]
[5354,"Cherry, Doug (5354) 15%",5354,500]
[5355,"Crowell, Gil (5355) 15%",5355,500]
[5356,"Truex, Aubrey (5356) 15%",5356,500]
[5357,"Truex Special (5357) 10%",5357,500]
[5358,"Cain, Michael & Kathy (5358) 15%",5358,500]
[5359,"Cain Special Fund (5359) 10%",5359,500]
[5360,"Humprey Fellows (5360) 0%",5360,500]
[5361,"Christofer, Hannah (5361) 15%",5361,500]
[5362,"Weston, Tim (5362) 15%",5362,500]
[5363,"Weston Special (5363) 10",5363,500]
[5364,"Adrian, Anne (5364) 15%",5364,500]
[5365,"Adrian, Special (5365) 10%",5365,500]
[5368,"Whitman, Mort and Jenny (5368) 15%",5368,500]
[5369,"Whitman Special (5369) 10%",5369,500]
[5370,"Quek, Kelly (5370) 15%",5370,500]
[5371,"Quek Special (5371) 10%",5371,500]
[5375,"Shelley, David (5375) 15%",{"$f":"A273","v":5375},500]
[5376,"Desai Special (5376) 10%",5376,500]
[5377,"Seattle Student Spon (5377) 0% {Frambes}",5377,500]
[5378,"Hershberger, Mike (5378) 15%",5378,500]
[5379,"Gilpin, Amber (5379) 15%",5379,500]
[5381,"Howard, Judith (5381) 15%",5381,500]
[5383,"Godwin, Elizabeth & Paul (5383) 15%",5383,500]
[5384,"Godwin Special (5384) 10%",5384,500]
[5385,"Hadley Special (5385) 10%",5385,500]
[5386,"Hadley, Barbara (5386) 15%",5386,500]
[5387,"Lindsey, Jennifer (5387) min rep 15%",5387,500]
[5388,"Song, Si-Chun (5388) 15% min",5388,500]
[5389,"Petrick, Chris (5389) 15%",5389,500]
[5391,"Althouse, Valerie (5391) 15%",5391,500]
[5393,"Nordtvedt, Joel & Marybeth (5393) 15%",5393,500]
[5394,"Anthony, Jeff (5394) 15%",5394,500]
[5395,"Kragbe, Lisa (5395) 15%",5395,500]
[5396,"Easton, Valerie (5396) 15%",5396,500]
[5398,"Lim, Daniel (5398) 15%",5398,500]
[5399,"Weidler, John (5399) 15%",5399,500]
[5402,"Chicago Mobilization - (5402) 10% {ingram}",5402,500]
[5404,"Emery, Lesley & Wayne (5404) 15%",5404,500]
[5407,"Helmen, Jerry (5407) min rep 15%",5407,500]
[5408,"Dallas, City of (5408) 15% {bunyard}",5408,500]
[5409,"Dallas Activity/Retreat (5409) 15% {bunyard}",5409,500]
[5410,"Dallas City Events (5410) 5%5% {bunyard}",5410,500]
[5411,"Lockwood, Daniel & Toshiko (5411) 15%",5411,500]
[5414,"McKain Special (5414) 10%",5414,500]
[5416,"Notehelfer Special (5416) 10%",5416,500]
[5417,"Notehelfer, Tim & Kim (5417) 15%",5417,500]
[5419,"South Central Chinese Ministry (5419) 15%",5419,500]
[5424,"Smucker, Matthew (5424) 15%",5424,500]
[5425,"Storms, David (5425) min rep 15%",5425,500]
[5426,"Killion Special (5426) 10%",5426,500]
[5427,"Newbrander, Tim  & Jacqueline (5427) 15%",5427,500]
[5428,"Newpher, Jeffrey (5428) 15%",5428,500]
[5430,"Hardy Special (5430) 10%",5430,500]
[5431,"Brannen, Dan Special (5431) 10%",5431,500]
[5434,"Boyd, William {Roy} (5434) min rep 15%",5434,500]
[5435,"Dickson, Larry & Pam (5435) min rep 15%",5435,500]
[5436,"Murchison, Marc & Elise (5436) min rep 15%",5436,500]
[5437,"Murchison Special (5437) min rep 10%",5437,500]
[5438,"Ubaldo, Daniel & Pam (5438) 15%",5438,500]
[5439,"Ng, Joanna (5439) 15%",5439,500]
[5440,"Cotton, Ray & Laurie (5440) 15%",5440,500]
[5441,"Cotton Special (5441) 10%",5441,500]
[5442,"Loh, Joel (5442) 15%",5442,500]
[5443,"Thomas, Sandeep {Thomas} (5443) 15%",5443,500]
[5447,"Gilchrist, Della (5447) min rep 15%",5447,500]
[5448,"Chijindu, Emmanuel (5448) 15%",5448,500]
[5449,"Lawecki, Phyllis (5449) 15%",5449,500]
[5450,"Lawecki Special (5450) 10%",5450,500]
[5452,"Ingram, Ronald (5452) 15%",5452,500]
[5453,"Manta, Don (5453) 15%",5453,500]
[5454,"Manta Special (5454) 10%",5454,500]
[5456,"Zeigler Special (5456) 10%",5456,500]
[5457,"Carlson Special (5457) 10%",5457,500]
[5463,"Freesen, Guy (5463) min rep 15%",5463,500]
[5465,"Miller, Ron & Gayle (5465) 15%",5465,500]
[5466,"Pollard, Peggy (5466) 15%",5466,500]
[5467,"Pollard Special (5467) 10%",5467,500]
[5469,"Witjandra, Fredinan (5469) 15%",5469,500]
[5470,"Witjandra Special (5470) 10%",5470,500]
[5471,"Dorning, Dawn (5471) min rep 15%",5471,500]
[5472,"Dorning Special (5472) 10%",5472,500]
[5477,"Pingel, Kirsten (5477) 15%",5477,500]
[5478,"Pingel Special (5478) 10%",5478,500]
[5480,"Mull, Andy & Diane (5480) 15%",{"$f":"A340","v":5480},500]
[5481,"Zull, Peter (5481) 15%",5481,500]
[5482,"Mosher, Craig (5482) 15%",5482,500]
[5483,"Sinclair, Kerry & Josie (5483) 15%",5483,500]
[5484,"Sinclair Special (5484) 10%",5484,500]
[5485,"Welch, Audrey & Robert (5485) 15%",5485,500]
[5488,"Clements, Darius (5488) 15%",5488,500]
[5489,"Babcock, Randy & Jan (5489) 15%",5489,500]
[5490,"Runyon, Stephen (5490) min rep 15%",5490,500]
[5491,"Babcock Special (5491) 10%",5491,500]
[5492,"Leavister, Margaret (5492) 15%",5492,500]
[5493,"Rigstad, Dennis & Dotty (5493) 15%",5493,500]
[5494,"Rigstad Special (5494) 10%",5494,500]
[5495,"Barnett Special (5495) 10%",5495,500]
[5497,"Sawyer, Doug (5497) 15%",5497,500]
[5498,"Carter, Katy (5498) 15% min",5498,500]
[5499,"Portland Student Trips (5499) 15%",5499,500]
[5500,"Kruger Memorial/City Ministries (5500) 15%",5500,500]
[5501,"Champoux, Ginny  (5501) 15%",5501,500]
[5503,"Champoux, Larry & Lucy (5503) 15%",5503,500]
[5504,"Champoux L. Special (5504) 10%",5504,500]
[5505,"Goll, Joseph & Sheryl (5505) 15%",5505,500]
[5507,"Dan McCoy Memorial Fund (5507) 15%",5507,500]
[5508,"Decker, J. Gordon (5508) 10%",5508,500]
[5509,"Decker Special Trip Account (5509) 10%",5509,500]
[5510,"Decker Car Replacement Account (5510) 10%",5510,500]
[5512,"Gold, Timothy (5512) 15%",5512,500]
[5513,"Champoux  G. Special (5513) 10%",5513,500]
[5514,"Bricker, Alex (5514) 15%",5514,500]
[5519,"Peterson, Nancy (5519) 15%",5519,500]
[5520,"Peterson Special (5520) 10%",5520,500]
[5526,"Cox, Joanna (5526) 15%",5526,500]
[5527,"Frambes, Kirk & Linda (5527) 15%",5527,500]
[5529,"Chicago Christian Stud Mob (5529) 15% {ingram}",5529,500]
[5530,"Ong, Andre (5530) min rep 15%",5530,500]
[5531,"Schaeffer Special (5531) 10%",5531,500]
[5533,"Elisha, Stephen (5533) 15%",5533,500]
[5534,"Blackburn, Eleanor (5534) 15% retiree",5534,500]
[5536,"Mammadov, Amy (5536) 15%",5536,500]
[5537,"Larson, David & Beth (5537) 15%",5537,500]
[5538,"Larson Special Fund (5538) 10%",5538,500]
[5539,"David, Samuel (5539) 15%",5539,500]
[5540,"Sigman, Tim & Julie  (5540) 15%",5540,500]
[5541,"Sigman Special (5541) 10%",5541,500]
[5542,"Green, Sam & Courtney (5542) 15%",5542,500]
[5543,"Jackson Bob & Sandra Special (5543) 10%",5543,500]
[5544,"Ford, Andrea (5544) 15%",5544,500]
[5548,"Bull, Patricia (5548) 15%",5548,500]
[5549,"Ndibongo, Quintin (5549) min rep 15%",5549,500]
[5550,"Bergman, Jeff & Michiko (5550) 15% min rep",5550,500]
[5551,"Cermak, Tony & Dayna (5551) 15%",5551,500]
[5552,"Hansen, Randy (5552) 15%",5552,500]
[5553,"Price, George & Linda (5553) 15% min",5553,500]
[5554,"Quinn, Kevin & Lynne (5554) min rep 15%",5554,500]
[5557,"Gunderson, Paul (5557) 15% Min Rep",5557,500]
[5559,"Allen Norm Special (5559) 15%",5559,500]
[5560,"Carroll, Sam & Joanne (5560)015%",5560,500]
[5561,"Antoniuk, Jeanette (5561) 15% Retiree",5561,500]
[5562,"Grove, Andy (5562) 15%",5562,500]
[5563,"Flammini, Steven & Sandra (5563) 15% min rep",5563,500]
[5565,"Hinke Special (5565) 10%",5565,500]
[5566,"Burton, Paul (5566) 15%",5566,500]
[5567,"Lapinski, Angela (5567) 15%",5567,500]
[5572,"Joseph, Sabu (5572) 15%",5572,500]
[5573,"Joseph Special (5573) 10%",{"$f":"A404","v":5573},500]
[5574,"Innis, Shirley (5574) 15%",5574,500]
[5575,"Hawkins, Scott (5575) 15%",5575,500]
[5576,"Chau, Kenny (5576) 15%",5576,500]
[5577,"Johnson, Edith (5577) 8.5%",5577,500]
[5579,"Pierce Special (5579) 10%",5579,500]
[5580,"Fatty, Sainey (5580) 15%",5580,500]
[5581,"Berger, John & Linda (5581) 15%",5581,500]
[5582,"Berger Special (5582) 10%",5582,500]
[5584,"Billings, Judy (5584) 15%",5584,500]
[5586,"Hawkins Special (5586) 10%",5586,500]
[5591,"Ciganic, Adrian (5591) 15% min rep",5591,500]
[5593,"Hargreaves, Sheila (5593) 15%",5593,500]
[5594,"Halligan, Dale & Liz (5594) 15%",5594,500]
[5595,"Halligan Special (5595) 10%",5595,500]
[5596,"Egan, Debbie & Bob (5596) 15%",5596,500]
[5597,"Bevan, Rod & Joyce (5597) 15% min rep",5597,500]
[5600,"Huston, Richard (5600) 15% Min",5600,500]
[5606,"Roelants, Renee (5606) 15% min rep",5606,500]
[5607,"Colaco, Noel (5607) min rep 15%",5607,500]
[5609,"Smith, Dan (5609) 15%",5609,500]
[5610,"Seever, Eric & Angela (5610) 15%",5610,500]
[5612,"Townsend, Jeffrey (5612) 10%",5612,500]
[5613,"Kendagor, Solomon & Ruby (5613) 15%",5613,500]
[5614,"Kendagor Special (5614) 10%",5614,500]
[5617,"Yesudasan, Teddy (5617) 15%",5617,500]
[5619,"Black, Helen (5619) 15%",5619,500]
[5620,"Willis, Kristy (5620) 15%",5620,500]
[5621,"Max, Vivienne (5621) 8.5%",5621,500]
[5622,"Pierce, Holly and Travis (5622) 15%",5622,500]
[5623,"Auvil, Ron (5623) 15%",5623,500]
[5624,"Means, Melba (5624) 8.5%",5624,500]
[5625,"Bogen, Mark (5625) 15%",5625,500]
[5627,"Huang, Echo (5627) 15%",5627,500]
[5628,"Cote, Jennifer (5628) 15%",5628,500]
[5632,"Samson, Jennifer (5632) 15%",5632,500]
[5634,"Farmer, Aaron & Lydia (5634) 15%",5634,500]
[5636,"Matheny, Scott & Kathy (5636) 15%",5636,500]
[5638,"Mills, Jessica (5638) 15%",5638,500]
[5640,"Vest, Mary Ann (5640) 15%",5640,500]
[5641,"Coleman, Fred & Pixie (5641) 15%",5641,500]
[5643,"Makin, Steve & Cathy (5643) 15%",5643,500]
[5644,"Twin Cities Scholarships (5644) 0% {Stynsberg}",5644,500]
[5647,"Douglass, Carol (5647) 15%",5647,500]
[5648,"Douglass Special (5648) 10%",5648,500]
[5649,"Lassiter, Jordan & Rebekah (5649) 15% min",5649,500]
[5651,"Paxton, Marion (5651) 15%",5651,500]
[5652,"Tippery, Gabriel (5652) 15% min",5652,500]
[5653,"Mannon Special (5653) 10%",5653,500]
[5654,"Thiagarajan, S & R (5654) 8.5%",5654,500]
[5656,"Haislip, Kevin (5656) 15% min",5656,500]
[5657,"Thiagarajan Special (5657) 10%",5657,500]
[5658,"Kolstad, Jan & David (5658) min rep 15%",5658,500]
[5659,"Stynsberg, JaNae (5659) 15%",5659,500]
[5660,"Baker, Herb/Gloria (5660) 8.5%",5660,500]
[5661,"Yu, Terry (5661) 15%",5661,500]
[5662,"Shih, Ping-yi (5662) 15%",5662,500]
[5663,"Shih Special (5663) 10%",5663,500]
[5664,"Davis Special (5664) 10%",5664,500]
[5666,"Bell, Andrew (5666) 15%",5666,500]
[5667,"Spady, Jim (5667) 15%",5667,500]
[5668,"Spady Special (5668) 10%",5668,500]
[5670,"McFarland, Howard (5670) 8.5%",5670,500]
[5671,"Lackey, Heather (5671)15%",5671,500]
[5672,"Burton, Kristi (5672) min rep 15%",5672,500]
[5673,"Burton Special (5673) min rep 10%",{"$f":"A469","v":5673},500]
[5679,"Herman, Jamieson (5679) 15%",5679,500]
[5681,"Cordell, Beth (5681) 15%",5681,500]
[5683,"Chen Special (5683) min rep 15%",5683,500]
[5684,"Chen, Jennifer (5684) Min Rep 15%",5684,500]
[5686,"Desai, John & Aruna (5686) 15%",5686,500]
[5687,"Shirk, Carl & Lesley (5687) 15%",5687,500]
[5688,"Haddock, Stephanie (5688) 15%",5688,500]
[5689,"Fitzgerald China Trip (5689) min rep 10%",5689,500]
[5690,"Fitzgerald, Robert (5690) min rep 15%",5690,500]
[5691,"Fitgerald Special(5691) min rep 10%",5691,500]
[5692,"Desai House Fund (5692) 0%",5692,500]
[5693,"Jaletta, Blen  (5693) 15%",5693,500]
[5694,"Germann Special (5694) 10%",5694,500]
[5695,"Germann, Ed (5695) 10%",5695,500]
[5699,"McCoy Special (5699) 10%",5699,500]
[5700,"Maneevone Special (5700) 10%",5700,500]
[5701,"Maneevone, Wichit (5701) 15%",5701,500]
[5704,"Tidd, Joshua (5704) 15%",5704,500]
[5706,"Brannen, Dan & Carolyn (5706) 10%",5706,500]
[5707,"Mahmoudi, Mohammad (5707) 15%",5707,500]
[5708,"Townsend, Opal (5708) 8.5%",5708,500]
[5709,"Yamazawa, Naomi (5709) 15%",5709,500]
[5710,"Chen, Denise (5710) 15% min",5710,500]
[5712,"Herring, Richard (5712) 15%",5712,500]
[5713,"Carpenter, Amber (5713) 15%",5713,500]
[5715,"Durstenfeld, Robert (5715) 15%",5715,500]
[5718,"Downs, Ian & Erin (5718) 15%",5718,500]
[5719,"Downs Special (5719) 10%",5719,500]
[5720,"Flynn, Patrick & Christy Lynn (5720) 15%",5720,500]
[5721,"Flynn Special (5721) 10%",5721,500]
[5722,"Shelling, Ted (5722) 8.5%",5722,500]
[5726,"Langford, Lezlie (5726) 15%",5726,500]
[5728,"Moynihan, Wendy (5728) 15%",5728,500]
[5730,"Roberson, William (5730) 15% min",5730,500]
[5731,"Bullington Special (5731) 10%",5731,500]
[5733,"Elisha Special (5733) 10%",5733,500]
[5734,"Yabuki Special (5734) 10%",5734,500]
[5735,"Yabuki, Roy & Lisa (5735) 15%",5735,500]
[5736,"Lin, Luisa & David (5736) 15%",5736,500]
[5737,"Menge, Sarah (5737) 15%",5737,500]
[5738,"Camomile, Jim & Lisa (5738) 15%",5738,500]
[5740,"Lam, Hon (5740) 15%",5740,500]
[5743,"Dodd, Lisa & Chuck (5743) 15%",5743,500]
[5744,"Fife, Joan & Eric (5744) 8.5%",5744,500]
[5747,"Lasher, Trace (5747) 15%",5747,500]
[5750,"Herholz, Shaun & Andreea (5750) 15%",5750,500]
[5751,"Mills, Ron & Beth (5751) 15%",5751,500]
[5752,"Mills Special (5752) 10%",5752,500]
[5754,"Stark, James {Alex} (5754) min rep 15%",5754,500]
[5755,"Holbrook, Lonnie & Courtney (5755) 15%",5755,500]
[5757,"Seger, Christine (5757) 15%",5757,500]
[5759,"Harms, Joseph (5759) 15%",5759,500]
[5760,"South Florida Ops (5760) 15% {Germann}",5760,500]
[5761,"South Florida Events (5761) 5%5% {Germann}",5761,500]
[5763,"Halferty, Sarah (5763) 15% min",5763,500]
[5764,"Allen, Norm (5764) 15%",5764,500]
[5768,"Saur, Ted & Denise (5768) minn rep 15%",5768,500]
[5770,"Kansas City Area Scholarships (5770) 0% {Douglas}",5770,500]
[5772,"Watson, Luke & Maudie (5772) 15%",5772,500]
[5773,"Simpson, Jimmy & Chloe (5773) 15%",5773,500]
[5774,"Marshall, Kent & Judy (5774) 15%",5774,500]
[5775,"Marshall Special (5775) 10%",5775,500]
[5776,"Bunyard, Ronald (5776) 15%",5776,500]
[5777,"Becker, Judith (5777) 15%",{"$f":"A533","v":5777},500]
[5779,"Becker Special (5779) 10%",5779,500]
[5781,"Zhao, Yun-Juan (5781) min rep 15%",5781,500]
[5783,"Jackson, Derrah & Pam (5783) 10%",5783,500]
[5784,"Caddell, Angela (5784) 15%",5784,500]
[5786,"Krehbiel Special (5786) 10%",5786,500]
[5787,"DePalatis, Carolyn (5787) 15%",5787,500]
[5788,"Depalatis Special (5788) 10%",5788,500]
[5789,"Webster Special Fund (5789) 10%",5789,500]
[5792,"Mitchell, Bill (5792) 15%",5792,500]
[5793,"Zeigler, Simon & Becky (5793) 10%",5793,500]
[5794,"Krehbiel, Dave (5794) min rep 15%",5794,500]
[5795,"Webster, Erna (5795) 15%",5795,500]
[5797,"Houston City (5797) 15% {Yabuki}",5797,500]
[5798,"Houston Events (5798) 5%5% {Jackson}",5798,500]
[5799,"Boston Student Activity (5799) 15% {Hope}",5799,500]
[5800,"Ann Arbor Bible  (5800) 5% {champoux}",5800,500]
[5801,"Ann Arbor (5801) 15% {champ l}",5801,500]
[5802,"Ames, IA (5802) 15% {Hansen}",5802,500]
[5803,"Spokane, WA (5803) 15% {zeigler}",5803,500]
[5804,"Buffalo F/R Events (5804) 5%5% {manta}",5804,500]
[5805,"Bloomington, Indiana (5805) 15% {hawes}",5805,500]
[5806,"Boston, MA  (5806) 15% {hope}",5806,500]
[5807,"Buffalo, NY (5807) 15% {matheny}",5807,500]
[5808,"Chicago, IL (5808) 15% {ingram}",5808,500]
[5809,"Cincinati City (5809) 10% {Germann}",5809,500]
[5810,"Colorado Springs (5810) 15% {halverson}",5810,500]
[5811,"UT Arlington Student Activity (5811) 15% {bunyard}",5811,500]
[5812,"Training Events (5812) 15% {decker}",5812,500]
[5813,"Washington DC (5813) 15% {Sigman}",5813,500]
[5814,"DU Ministry (5814) 15% {compton}",5814,500]
[5815,"Eugene Area (5815) 15% {smith}",5815,500]
[5816,"North Texas ISM (5816) 15% {yabuki}",5816,500]
[5819,"Rochester City (5819) 15% {larson}",5819,500]
[5820,"Twin Cities City (5820) 15% {Stynsberg}",5820,500]
[5821,"NYC (5821) 15% {Althouse}",5821,500]
[5822,"Univ of CA Irvine (5822) 15% {Pearce}",5822,500]
[5823,"Monterey (5823) 15% {zeigler}",5823,500]
[5824,"Portland Events (5824) 5%5% {sinclair}",5824,500]
[5825,"Virginia Scholarships (5825) 0% {truex}",5825,500]
[5826,"Portland, OR- (5826) 15% {sinclair}",5826,500]
[5827,"Princeton, NJ (5827) 15% {desai}",5827,500]
[5828,"Phoenix City (5828) 15% {crowell}",5828,500]
[5829,"Tempe (5829) 15% {boyle}",5829,500]
[5830,"San Diego Cnty Ops (5830) 15% {maneevone",5830,500]
[5831,"Seattle City (5831) 15% {Frambe}",5831,500]
[5832,"Seattle Events (5832) 5%5% {Frambe}",5832,500]
[5833,"ST LOUIS (5833) 15% {Dugo}",5833,500]
[5835,"St. Louis Activities (5835) 15% {Dugo}",5835,500]
[5836,"Albuquerque City (5836) 15% {Yabuki}",5836,500]
[5837,"Kalamazoo City (5837) 15% {Germann}",5837,500]
[5838,"Chicago Events (5838) 5%5% {ingram}",5838,500]
[5839,"AustinStudSponsorshp (5839) 0% {Yabuki}",5839,500]
[5840,"Hays, KS (5840) 15% {Yabuki}",5840,500]
[5841,"Baltimore (5841) 15% {tash}",5841,500]
[5842,"Boulder City Account (5842) 15% {jackson}",5842,500]
[5843,"Rapid City Events (5843) 5%5% {fannin}",5843,500]
[5844,"Durham City (5844) 15% {hawkins}",5844,500]
[5845,"Rocklin, CA (5845) FS 15% {zeigler}",5845,500]
[5846,"Boise, ID (5846) 15% {dunne}",5846,500]
[5847,"Greensboro, NC (5847) 15% {Egan}",5847,500]
[5848,"Santa Barbara (5848) 15% {notehelfer}",5848,500]
[5849,"Kearney, NE (5849) 15% {Jackson}",5849,500]
[5850,"Phoenix Fundraising Evnt (5850) 5%5% {crowell}",5850,500]
[5851,"TCU Campus Ministyr (5851) 15% {bunyard}",{"$f":"A597","v":5851},500]
[5853,"Muslim Task (5853) 0% {halverson}",5853,500]
[5854,"FT Collins (5854) 15% {babcock}",5854,500]
[5855,"East Bay Events (5855) 5%5% {harper}",5855,500]
[5856,"East Bay City (5856) 15% {harper}",5856,500]
[5857,"Ft. Collins Events (5857) 5%5% {babcock}",5857,500]
[5858,"Rapid City, SD Ops (5858) 15% {fannin}",5858,500]
[5859,"RapidCity Student Conf (5859) 0% {fannin}",5859,500]
[5860,"Buffalo Student Conf (5860) 0% {manta}",5860,500]
[5861,"Rocky Mtn Events (5861) 5%5% {jackson}",5861,500]
[5863,"Southeast Michigan (5863) 15% {Germann}",5863,500]
[5866,"Kansas City (5866) 15% {douglass}",5866,500]
[5867,"Nebraska State (5867) 15% {jackson}",5867,500]
[5868,"Bakersfield, CA(5868) 15% {davis}",5868,500]
[5870,"Western Region Scholarship (5870) 0% {zeigler}",5870,500]
[5871,"Pueblo, CO (5871)  15% {jackson}",5871,500]
[5872,"Denver City (5872) 15% {mills}",5872,500]
[5873,"Boston Scholar (5873) 0% {hope}",5873,500]
[5874,"Bozeman, MT City (5874) 15% {Sodergren}",5874,500]
[5875,"Tempe Area Scholarships (5875) 0% {Mills}",5875,500]
[5876,"Portland Scholarships (5876) 0% {sinclair}",5876,500]
[5878,"Dallas Student Spons (5878) 0% {Bunyard}",5878,500]
[5879,"A&M Campus, TX (5879) 15% {marshall}",5879,500]
[5880,"Honolulu City (5880) 15% {shaw}",{"$f":"A620","v":5880},500]
[5881,"San Diego Scholarship (5881) 0% {maneevone}",5881,500]
[5882,"St. Louis Events (5882) 5%5% {Weston}",5882,500]
[5883,"Irvine, CA Event (5883) 5% 5% {apgsr}",5883,500]
[5884,"Irvine, CA (5884) 15% {apgar}",5884,500]
[5885,"LA/Orange Stud Spon (5885) 0% {pearce}",5885,500]
[5886,"Riverside County, CA (5886) 15% {zeigler}",5886,500]
[5887,"Ann Arbor Conf/Ret (5887) 0% {champ l}",5887,500]
[5888,"Ann Arbor Events (5888) 5%5% {champ l}",5888,500]
[5889,"A&M Student Sponsorships (5889) 0% {marshall}",5889,500]
[5890,"UT Arlington (5890) 15% {bunyard}",5890,500]
[5891,"UTD Ministry (5891) 15% {cotton}",5891,500]
[5892,"Rhode Island (5892) 15% {hope}",5892,500]
[5893,"SMU Min/Dallas (5893) 15% {yabuki}",5893,500]
[5894,"Maine & New Hamp (5894) 15% {webster}",5894,500]
[5895,"Boston Events (5895) 5%5% {Hope}",5895,500]
[5896,"NE Region Events (5896) 5%5% {hope}",5896,500]
[5897,"Buffalo Special (5897) 10% {manta}",5897,500]
[5898,"Dallas Area Internships (5898) 15% {Yabuki}",5898,500]
[5899,"Mitchell Special (5899) 10%",5899,500]
[5900,"LA County Events (5900) 5%5% {pearce}",5900,500]
[5901,"LA/So Cal Ops (5901) 15% {pearce}",5901,500]
[5902,"San Jose, CA (5902) 15% {zeigler}",5902,500]
[5903,"Vermillion, SD (5903) 15% {jackson}",5903,500]
[5904,"Crowell, Teri (5904) 15%",5904,500]
[5905,"Crowell Special (5905) 10%",5905,500]
[5906,"Zull, Special  (5906) 10%",5906,500]
[5907,"Lee-Paul, Nancy (5907) 15%",5907,500]
[5908,"Claassen, Gary (5908) 15%",5908,500]
[5910,"San Diego Events (5910) 5%5% {maneevone}",5910,500]
[5911,"Dorsch, Bob (5911) 15%",5911,500]
[5912,"Harper, Leon (5912) 10%",5912,500]
[5913,"Harper Special (5913) 10%",5913,500]
[5914,"Dykstra, Judy & Doug (5914) 15%",5914,500]
[5916,"Washington, Dennis (5916) 15%",5916,500]
[5917,"Chan, Samuel (5917) min rep 15%",5917,500]
[5918,"Weir, John (5918) 15%",5918,500]
[5920,"Woo, Rebecca (5920) 15%",5920,500]
[5921,"Raybon, Debbie (5921) 15%",5921,500]
[5922,"Kopp, Rob (5922) 15%",5922,500]
[5925,"Bastian, Doug & Patty (5925) 15%",5925,500]
[5927,"Johnson, Geg & Liz (5927) 15%",5927,500]
[5949,"Eilers, Gary & Alice (5949) min rep 15%",5949,500]
[5956,"Lee, Eva (5956) 15%",5956,500]
[5963,"Friends International UK (5963) 5%",{"$f":"A664","v":5963},500]
[5995,"Fund 500 Holding (5995) 0% CG",5995,500]
[5999,"Annunities/Trusts/Wills (5999) 0%",5999,500]
[7900,"ISI HO Building Campaign (7900) 0%",7900,300]
[9136,"Pearce, Andy (9136) 15%",{"$f":"A668","v":9136},500]
[9250,"National Ministry Fund Intl (9250) 0%",9250,500]
[9307,"Frost, Jim Intl (9307) 15%",{"$f":"A670","v":9307},500]
[9336,"Cossette, Richard & Carol (9336) 15%",{"$f":"A671","v":9336},500]
[9394,"Anthony, Jeff (9394) 15%",{"$f":"A672","v":9394},500]
[9814,"DU Ministry Intl (9814) 15% {compton}",9814,500]
[9628,"Cote, Jennifer (9628) 15%",{"$f":"A674","v":9628},500]
[9661,"Yu, Terry (9661) 15%",{"$f":"A675","v":9661},500]
[9776,"Bunyard, Ron (9776) 15% intl",{"$f":"A676","v":9776},500]
[9826,"Portland Or (9826) 15%",{"$f":"A677","v":9826},500]
[5908,"claassen, Gary (9908) 15%",{"$f":"A678","v":5908},500]

{"sheet":"Lookups","index":3,"n_rows":20,"n_cols":11,"rows_kept":20,"hidden":true,"merged":[[3,7,3,8],[4,5,4,6],[5,5,5,6],[6,7,6,8],[7,5,7,6],[8,5,8,6]]}
[]
[]
[]
[{"$nulls":7},"number value"]
[{"$nulls":4},"Date","Time",null,"time","date"]
[{"$nulls":3},"deadline date",{"$f":"IF(datefilledouttext=\"Thursday\",datefilledout+6,IF(datefilledouttext=\"Friday\",datefilledout+5,IF(datefilledouttext=\"Saturday\",datefilledout+4,IF(datefilledouttext=\"Sunday\",datefilledout+3,IF(datefilledouttext=\"Monday\",datefilledout+2,IF(datefilledouttext=\"Tuesday\",datefilledout+1,datefilledout))))))","v":"2019-08-21"},"12:00:00",null,{"$f":"_xlfn.NUMBERVALUE(deadlinetime)","v":{"v":0.5,"d":"0.500000"}},{"$f":"_xlfn.NUMBERVALUE(deadlinedate)","v":{"v":43698,"d":"43698.000000"}},{"$f":"TEXT(deadlinedate,\"DDDD\")","v":"Wednesday"},{"$f":"deadlinetime","v":0.5}]
[{"$nulls":3},"date filled out",{"$f":"IF(OR(Date_Filed<>\"\",Date_Filed>0),Date_Filed,IF(OR(Due_Date<>\"\",Due_Date>0),Due_Date,E9))","v":"2019-08-15"},null,null,{"$f":"deadlinetimenumber+deadlinedatenumber","v":43698.5},null,{"$f":"TEXT(datefilledout,\"DDDD\")","v":"Thursday"}]
[{"$nulls":3},"due date",{"$f":"Due_Date","v":"00:00:00"},{"$f":"ROUND((H7-H9),2)*24&\" hrs\"","v":"144.96 hrs"},{"$nulls":3},{"$f":"Due_Date","v":"00:00:00"},100]
[{"$nulls":3},"today",{"$f":"TODAY()","v":"2019-08-15"},{"$f":"NOW()","v":43692.46481967592},null,{"$f":"_xlfn.NUMBERVALUE(currenttime)","v":43692.4648196759},null,{"$f":"E9","v":"2019-08-15"},200]
[{"$nulls":10},220]
[{"$nulls":10},300]
[{"$nulls":10},501]
[]
[]
[]
[{"$nulls":4},"(Please choose one)",null,null,{"$f":"IF(datefilledouttext<>\"wednesday\",\"The deadline for A/P vendor payments is \"&TEXT(deadlinedate,\"DDDD MMM DD\")&\" at noon.\",H18)","v":"The deadline for A/P vendor payments is Wednesday Aug 21 at noon."}]
[{"$nulls":4},"Check"]
[{"$nulls":4},"ACH",null,null,{"$f":"IF(AND(datefilledouttext=\"Wednesday\",currenttimenumber<H7),\"You only have \"&F8&\" to submit your request\",\"You have missed the deadline for this week.\")","v":"You have missed the deadline for this week."}]
[{"$nulls":4},"Direct Deposit"]
[{"$nulls":4},"Wire",null,null,{"$f":"IF(AND(datefilledouttext=\"Wednesday\",currenttimenumber<deadlinetimenumber+deadlinedatenumber),\"You only have \"&F8&\" to submit your request\",\"You have missed the deadline for this week.\")","v":"You have missed the deadline for this week."}]